Bugfix release. From the release notes:
Some backports of important fixes to the 1.25 series, for very conservative
people.
libmpg123: Backport bit reservoir CRC fix from 1.26
libmpg123: Backport part2_3_length regression fix (bug 312).
Signed-off-by: Peter Korsgaard <peter@korsgaard.com>
(cherry picked from commit d495593de1)
Signed-off-by: Peter Korsgaard <peter@korsgaard.com>
Since putty is only affected by this CVE on Windows, ignore it in the
stable branch. Branch master is not affected anymore already, due to
newer version which got fixed.
Signed-off-by: Alexander Dahl <post@lespocky.de>
Signed-off-by: Peter Korsgaard <peter@korsgaard.com>
The domain for their email is now a parking-site, and mails are not
delivered anymore.
Signed-off-by: Yann E. MORIN <yann.morin.1998@free.fr>
(cherry picked from commit 48235e6fc5)
Signed-off-by: Peter Korsgaard <peter@korsgaard.com>
Fixes the following security issues:
- CVE-2021-33195: The LookupCNAME, LookupSRV, LookupMX, LookupNS, and
LookupAddr functions in net, and their respective methods on the Resolver
type may return arbitrary values retrieved from DNS which do not follow
the established RFC 1035 rules for domain names. If these names are used
without further sanitization, for instance unsafely included in HTML, they
may allow for injection of unexpected content. Note that LookupTXT may
still return arbitrary values that could require sanitization before
further use
- CVE-2021-33196: The NewReader and OpenReader functions in archive/zip can
cause a panic or an unrecoverable fatal error when reading an archive that
claims to contain a large number of files, regardless of its actual size
- CVE-2021-33197: ReverseProxy in net/http/httputil could be made to forward
certain hop-by-hop headers, including Connection. In case the target of
the ReverseProxy was itself a reverse proxy, this would let an attacker
drop arbitrary headers, including those set by the ReverseProxy.Director
- CVE-2021-33198: The SetString and UnmarshalText methods of math/big.Rat
may cause a panic or an unrecoverable fatal error if passed inputs with
very large exponents
Signed-off-by: Peter Korsgaard <peter@korsgaard.com>
libmpv-static and libmpv-shared are disabled by default resulting in the
following build failure when building with gl but without rpi, wayland
or x11:
Checking for OpenGL without platform-specific code (e.g. for libmpv) : libmpv-shared not found
Checking for OpenGL context support : gl-cocoa not found
You manually enabled the feature 'gl', but the autodetection check failed.
Here is an extract of wscript:
} , {
'name': '--plain-gl',
'desc': 'OpenGL without platform-specific code (e.g. for libmpv)',
'deps': 'libmpv-shared || libmpv-static',
'func': check_true,
}, {
'name': '--gl',
'desc': 'OpenGL context support',
'deps': 'gl-cocoa || gl-x11 || egl-x11 || egl-drm || '
+ 'gl-win32 || gl-wayland || rpi || '
+ 'plain-gl',
'func': check_true,
'req': True,
'fmsg': "No OpenGL video output found or enabled. " +
"Aborting. If you really mean to compile without OpenGL " +
"video outputs use --disable-gl.",
}, {
Enabling both the shared and static libraries is not allowed by mpv, so
we consider the BR2_STATIC_LIBS to be static, and otherwise (i.e.
BR2_SHARED_LIBS and BR2_SHARED_STATIC_LIBS) to be shared.
Fixes:
- http://autobuild.buildroot.org/results/590d2a8b6746ef071dfb439e42b636f81dbdc35d
Signed-off-by: Fabrice Fontaine <fontaine.fabrice@gmail.com>
[yann.morin.1998@free.fr:
- expand config log about shared/static icompatibility
]
Signed-off-by: Yann E. MORIN <yann.morin.1998@free.fr>
(cherry picked from commit 8601137c08)
Signed-off-by: Peter Korsgaard <peter@korsgaard.com>
Disable dc3dd on riscv32 because of the size of time_t (riscv32 has
never had a 32-bit time, and has always been 64-bit from the onset):
In file included from getdate.y:40:
verify.h:132:30: error: negative width in bit-field 'verify_error_if_negative_size__'
132 | (struct { unsigned int verify_error_if_negative_size__: (R) ? 1 : -1; }))
| ^~~~~~~~~~~~~~~~~~~~~~~~~~~~~~~
verify.h:138:61: note: in expansion of macro 'verify_true'
138 | # define verify(R) extern int (* verify_function__ (void)) [verify_true (R)]
| ^~~~~~~~~~~
getdate.y:116:1: note: in expansion of macro 'verify'
116 | verify (LONG_MIN <= TYPE_MINIMUM (time_t) && TYPE_MAXIMUM (time_t) <= LONG_MAX);
| ^~~~~~
Fixes:
- http://autobuild.buildroot.org/results/267151dec9d2328a5f8c61ddf224219a4f617e5c
Signed-off-by: Fabrice Fontaine <fontaine.fabrice@gmail.com>
Signed-off-by: Yann E. MORIN <yann.morin.1998@free.fr>
(cherry picked from commit 6b9d2ab455)
Signed-off-by: Peter Korsgaard <peter@korsgaard.com>
Add Libs.private to libraw.pc to fix the following static build failure
with imagemagick which is raised since commit
2f47cfade4:
/home/giuliobenetti/autobuild/run/instance-1/output-1/host/opt/ext-toolchain/bin/../lib/gcc/arm-buildroot-linux-uclibcgnueabi/9.3.0/../../../../arm-buildroot-linux-uclibcgnueabi/bin/ld: /home/giuliobenetti/autobuild/run/instance-1/output-1/host/bin/../arm-buildroot-linux-uclibcgnueabi/sysroot/usr/lib/libjasper.a(jpg_enc.c.o): in function `jpg_encode':
jpg_enc.c:(.text+0x1f4): undefined reference to `jpeg_stdio_dest'
Fixes:
- http://autobuild.buildroot.org/results/88e43a1ea2059a684e50b0f5f2af407e8c6df2e1
Signed-off-by: Fabrice Fontaine <fontaine.fabrice@gmail.com>
Signed-off-by: Arnout Vandecappelle (Essensium/Mind) <arnout@mind.be>
(cherry picked from commit cb3b89e4cd)
Signed-off-by: Peter Korsgaard <peter@korsgaard.com>
Disabling tests will fix the following build failures on riscv32:
select_poll_epoll.c:408:16: note: each undeclared identifier is reported only once for each function it appears in
select_poll_epoll.c: In function 'ppoll_fds_ulong_max':
select_poll_epoll.c:440:16: error: 'SYS_ppoll' undeclared (first use in this function); did you mean 'SYS_tkill'?
440 | ret = syscall(SYS_ppoll, ufds, ULONG_MAX, NULL, NULL);
| ^~~~~~~~~
| SYS_tkill
select_poll_epoll.c: In function 'pselect_invalid_fd':
select_poll_epoll.c:488:16: error: 'SYS_pselect6' undeclared (first use in this function); did you mean 'SYS_semctl'?
488 | ret = syscall(SYS_pselect6, fd + 1, &rfds, NULL, NULL, NULL, NULL);
| ^~~~~~~~~~~~
| SYS_semctl
Fixes:
- http://autobuild.buildroot.org/results/dd39188a7191efa512a51f18f4c34d9ee711a6a7
Signed-off-by: Fabrice Fontaine <fontaine.fabrice@gmail.com>
Signed-off-by: Arnout Vandecappelle (Essensium/Mind) <arnout@mind.be>
(cherry picked from commit 2df1c10ba7)
Signed-off-by: Peter Korsgaard <peter@korsgaard.com>
unscd unconditionally uses __NR_clock_gettime which will raise the
following build failure on riscv32:
nscd-0.54.c:339:14: error: '__NR_clock_gettime' undeclared (first use in this function); did you mean 'clock_gettime'?
339 | if (syscall(__NR_clock_gettime, CLOCK_MONOTONIC, &ts))
| ^~~~~~~~~~~~~~~~~~
| clock_gettime
Fixes:
- http://autobuild.buildroot.org/results/eb77b18f268d8e59c407f757662117a33d3f9ee3
Signed-off-by: Fabrice Fontaine <fontaine.fabrice@gmail.com>
Signed-off-by: Arnout Vandecappelle (Essensium/Mind) <arnout@mind.be>
(cherry picked from commit 34173da168)
Signed-off-by: Peter Korsgaard <peter@korsgaard.com>
Add -std=c++11 to fix the following build failure with gcc 11:
In file included from shared-ptr/base.cxx:5:
../cutl/shared-ptr/base.hxx:34:41: error: ISO C++17 does not allow dynamic exception specifications
34 | operator new (std::size_t, cutl::share) throw (std::bad_alloc);
| ^~~~~
Fixes:
- http://autobuild.buildroot.org/results/60a39d402a0d051c92aa11421b7a14f7729a0380
Signed-off-by: Fabrice Fontaine <fontaine.fabrice@gmail.com>
Signed-off-by: Arnout Vandecappelle (Essensium/Mind) <arnout@mind.be>
(cherry picked from commit 4d6ca0a8ac)
Signed-off-by: Peter Korsgaard <peter@korsgaard.com>
Recently in Buildroot the option BR2_PIC_PIE has been enabled by default along
with other hardening features [1]. Since then the nios2 defconfig
qemu_nios2_10m50_defconfig is failing to boot due to a segfault in init program:
Run /init as init process
with arguments:
/init
with environment:
HOME=/
TERM=linux
Failed to execute /init (error -12)
See Buildroot build log and Qemu runtime test log in build artifacts [2].
Analyzing one of the binary with strace show that the problem occur
very early when starting the new process:
# strace ./busybox
execve("./busybox", ["./busybox"], 0x7f91ce90 /* 10 vars */) = -1 ENOMEM
(Cannot allocate memory)
+++ killed by SIGSEGV +++
Several binutils/glibc/gcc version has been tested without any success.
The issue has been reported to the glibc mailing list but it can be a linker
or kernel bug [3].
For the Buildroot 2021.05 release, disable BR2_PIC_PIE until the problem is
found and fixed.
Fixes:
https://gitlab.com/buildroot.org/buildroot/-/jobs/1285145889
[1] https://git.buildroot.net/buildroot/commit/?id=810ba387bec3c5b6904e8893fb4cb6f9d3717466
[2] https://gitlab.com/buildroot.org/buildroot/-/jobs/1285145889
[3] https://sourceware.org/pipermail/libc-alpha/2021-May/126912.html
Signed-off-by: Romain Naour <romain.naour@gmail.com>
Cc: Yann E. MORIN <yann.morin.1998@free.fr>
Signed-off-by: Arnout Vandecappelle (Essensium/Mind) <arnout@mind.be>
(cherry picked from commit 6b4b63a571)
[Peter: backport to 2021.02.x to stop users from manually enabling BR2_PIC_PIE]
Signed-off-by: Peter Korsgaard <peter@korsgaard.com>
Fixes the following:
- CVE-2021-27803: A vulnerability was discovered in how p2p/p2p_pd.c in
wpa_supplicant before 2.10 processes P2P (Wi-Fi Direct) provision
discovery requests. It could result in denial of service or other impact
(potentially execution of arbitrary code), for an attacker within radio
range.
Signed-off-by: Sam Voss <sam.voss@collins.com>
Signed-off-by: Arnout Vandecappelle (Essensium/Mind) <arnout@mind.be>
(cherry picked from commit 93b8d601bc)
Signed-off-by: Peter Korsgaard <peter@korsgaard.com>
Fixes the following security issue:
- CVE-2021-25217: A buffer overrun in lease file parsing code can be used to
exploit a common vulnerability shared by dhcpd and dhclient
For details, see the advisory:
https://kb.isc.org/docs/cve-2021-25217
Update the LICENSE hash for a change of copyright years.
Signed-off-by: Peter Korsgaard <peter@korsgaard.com>
(cherry picked from commit cebf2b91b3)
Signed-off-by: Peter Korsgaard <peter@korsgaard.com>
Due to the recent events at Frenode [0], the channel has become a bit
unreliable (much spammed), and users have started to move away already,
as quite a few other projects have moved their IRC presence away from
Freenode.
There are a few alternatives. The first to spring to mind, is the new
Libera.Chat network [1], managed by the previous Freenode staff, so we
could expect quite a good experience there. However, it is a very young
network. The second well known alternative is the long-established OFTC,
which has been very reliable in its 20 years of existence.
So, let's move to OFTC, just because it has a track-record of robustness
(which Libera.Chat still has to build, for being young).
Note: there are a lot of other IRC networks, some very good too, but we
probably would be much off-topic on most of them.
[0] https://lwn.net/Articles/856543/
[1] https://libera.chat/
[2] https://www.oftc.net/
Signed-off-by: Yann E. MORIN <yann.morin.1998@free.fr>
Cc: Peter Korsgaard <peter@korsgaard.com>
Cc: Thomas Petazzoni <thomas.petazzoni@bootlin.com>
Cc: Arnout Vandecappelle (Essensium/Mind) <arnout@mind.be>
Acked-by: Matthew Weber <matthew.weber@collins.com>
Acked-by: Heiko Thiery <heiko.thiery@gmail.com>
Acked-By: Vincent Fazio <vfazio@xes-inc.com>
Acked-by: Peter Korsgaard <peter@korsgaard.com>
Signed-off-by: Yann E. MORIN <yann.morin.1998@free.fr>
(cherry picked from commit fe3cb7978a)
Signed-off-by: Peter Korsgaard <peter@korsgaard.com>
Fixes the following security issues:
- CVE-2021-22897: schannel cipher selection surprise
https://curl.se/docs/CVE-2021-22897.html
- CVE-2021-22898: TELNET stack contents disclosure
https://curl.se/docs/CVE-2021-22898.html
- CVE-2021-22901: TLS session caching disaster
https://curl.se/docs/CVE-2021-22901.html
Unconditionally disable the ldap(s) options. These require external
libraries, but the options were ignored if the needed libraries weren't
available. This is now changed to be a fatal error since
dae382a1a1
Additionally, add a post-7.77.0 upstream patch to fix compilation with
bearssl.
Signed-off-by: Peter Korsgaard <peter@korsgaard.com>
[yann.morin.1998@free.fr: annotate the patch, that it is a backport]
Signed-off-by: Yann E. MORIN <yann.morin.1998@free.fr>
(cherry picked from commit eae15d62c6)
Signed-off-by: Peter Korsgaard <peter@korsgaard.com>
boost logs can't be built with riscv32 because it unconditionally uses
__NR_futex:
libs/log/src/event.cpp: In member function 'void boost::log::v2_mt_posix::aux::futex_based_event::wait()':
libs/log/src/event.cpp:38:29: error: '__NR_futex' was not declared in this scope
38 | #define BOOST_LOG_SYS_FUTEX __NR_futex
| ^~~~~~~~~~
Fixes:
- http://autobuild.buildroot.org/results/8c8135fd7c0517c66c9b3975c494da6d7934cc1b
Signed-off-by: Fabrice Fontaine <fontaine.fabrice@gmail.com>
Signed-off-by: Arnout Vandecappelle (Essensium/Mind) <arnout@mind.be>
(cherry picked from commit d72350e62a)
Signed-off-by: Peter Korsgaard <peter@korsgaard.com>
Pass -DENABLE_GAMEPAD=OFF to CMake in order to disable support for the
gamepad API, which requires libmanette, a library that is not yet
available in Buildroot.
Signed-off-by: Adrian Perez de Castro <aperez@igalia.com>
Signed-off-by: Arnout Vandecappelle (Essensium/Mind) <arnout@mind.be>
(cherry picked from commit 97b2511edb)
Signed-off-by: Peter Korsgaard <peter@korsgaard.com>
Select a few missing multimedia related dependencies:
- BR2_PACKAGE_GST1_PLUGINS_GOOD_PLUGIN_AUTODETECT is needed for
"autoaudiosink"; not having this element can cause a crash as
it is used unconditionally.
- BR2_PACKAGE_GST1_PLUGINS_GOOD_PLUGIN_MATROSKA and
BR2_PACKAGE_GST1_PLUGINS_GOOD_PLUGIN_VPX are needed for
WebM video playback.
Signed-off-by: Adrian Perez de Castro <aperez@igalia.com>
Signed-off-by: Yann E. MORIN <yann.morin.1998@free.fr>
(cherry picked from commit 6823e59111)
Signed-off-by: Peter Korsgaard <peter@korsgaard.com>
webpmux is an optional dependency since version 2.2.0 and
b4735f7829
Signed-off-by: Fabrice Fontaine <fontaine.fabrice@gmail.com>
[yann.morin.1998@free.fr: move into existing webp conditional block]
Signed-off-by: Yann E. MORIN <yann.morin.1998@free.fr>
(cherry picked from commit a1f3e99f0e)
Signed-off-by: Peter Korsgaard <peter@korsgaard.com>
Fix the following build failure:
In file included from /data/buildroot-autobuilder/instance-0/output-1/build/host-llvm-9.0.1/utils/benchmark/src/benchmark_register.cc:15:
/data/buildroot-autobuilder/instance-0/output-1/build/host-llvm-9.0.1/utils/benchmark/src/benchmark_register.h: In function 'void AddRange(std::vector<T>*, T, T, int)':
/data/buildroot-autobuilder/instance-0/output-1/build/host-llvm-9.0.1/utils/benchmark/src/benchmark_register.h:17:30: error: 'numeric_limits' is not a member of 'std'
17 | static const T kmax = std::numeric_limits<T>::max();
| ^~~~~~~~~~~~~~
Fixes:
- http://autobuild.buildroot.org/results/68581aad7c622a1fc74bb5556799e3c681425b2a
Signed-off-by: Fabrice Fontaine <fontaine.fabrice@gmail.com>
Signed-off-by: Yann E. MORIN <yann.morin.1998@free.fr>
(cherry picked from commit 8d8f456d59)
Signed-off-by: Peter Korsgaard <peter@korsgaard.com>
Fixes CVE-2021-30465: runc 1.0.0-rc94 and earlier are vulnerable to a symlink
exchange attack whereby an attacker can request a seemingly-innocuous container
configuration that actually results in the host filesystem being bind-mounted
into the container, allowing for a container escape.
Signed-off-by: Christian Stewart <christian@paral.in>
Signed-off-by: Yann E. MORIN <yann.morin.1998@free.fr>
(cherry picked from commit 96c23d1d0f)
Signed-off-by: Peter Korsgaard <peter@korsgaard.com>
Fixes the following security issue:
- CVE-2021-32055: Mutt 1.11.0 through 2.0.x before 2.0.7 (and NeoMutt
2019-10-25 through 2021-05-04) has a $imap_qresync issue in which
imap/util.c has an out-of-bounds read in situations where an IMAP sequence
set ends with a comma. NOTE: the $imap_qresync setting for QRESYNC is not
enabled by default.
Signed-off-by: Peter Korsgaard <peter@korsgaard.com>
Fixes: CVE-2021-22207 Excessive memory consumption in MS-WSP dissector
in Wireshark 3.4.0 to 3.4.4 and 3.2.0 to 3.2.12 allows denial of service
via packet injection or crafted capture file
See also: https://www.wireshark.org/security/wnpa-sec-2021-04.html
Signed-off-by: Fabrice Fontaine <fontaine.fabrice@gmail.com>
[yann.morin.1998@free.fr: add CVE reference]
Signed-off-by: Yann E. MORIN <yann.morin.1998@free.fr>
(cherry picked from commit 92de0d76ad)
Signed-off-by: Peter Korsgaard <peter@korsgaard.com>
Commit f289b1b36f (legacy: drop options removed more than 5 years ago
now) forgot to remove a legacy default.
Signed-off-by: Yann E. MORIN <yann.morin.1998@free.fr>
(cherry picked from commit 5c07dfcc1a)
Signed-off-by: Peter Korsgaard <peter@korsgaard.com>
Signed-off-by: Heiko Thiery <heiko.thiery@gmail.com>
[yann.morin.1998@free.fr: propagate the dependency to kodi]
Signed-off-by: Yann E. MORIN <yann.morin.1998@free.fr>
(cherry picked from commit ac16bb646f)
Signed-off-by: Peter Korsgaard <peter@korsgaard.com>
python-bluezero selects python-gobject but fails to include its arch and
toolchain dependencies. Add them now, as well as the corresponding
comment.
dbus-python also has some dependencies, but all of them are covered by
the python3 dependency, so don't bother with those.
Fixes: 8bdc5e7c4d
Signed-off-by: Arnout Vandecappelle (Essensium/Mind) <arnout@mind.be>
(cherry picked from commit e2bcf6605a)
Signed-off-by: Peter Korsgaard <peter@korsgaard.com>
As of version 0.4.0 observer.py uses dbus-python (to comunicate with BlueZ)
instead of python-aioblescan. Thus, all modules now depend on dbus-python.
Signed-off-by: Grzegorz Blach <grzegorz@blach.pl>
Signed-off-by: Arnout Vandecappelle (Essensium/Mind) <arnout@mind.be>
(cherry picked from commit 8bdc5e7c4d)
Signed-off-by: Peter Korsgaard <peter@korsgaard.com>
ebtables 2.0.11 no longer works correctly when userland is 32-bit and the
kernel is 64-bit. This used to work correctly in version 2.0.10-4.
Problem is twofold:
- ebtables itself was broken and needs to be patched
- buildroot needs to pass the correct flag again to indicate when we are in
this situation
Signed-off-by: Thomas De Schampheleire <thomas.de_schampheleire@nokia.com>
Signed-off-by: Arnout Vandecappelle (Essensium/Mind) <arnout@mind.be>
(cherry picked from commit 4b5743e523)
Signed-off-by: Peter Korsgaard <peter@korsgaard.com>
assimp doesn't build with zlib-ng because Z_EXPORT and z_crc_t are used
by the bundled unzip source code
Signed-off-by: Fabrice Fontaine <fontaine.fabrice@gmail.com>
Signed-off-by: Arnout Vandecappelle (Essensium/Mind) <arnout@mind.be>
(cherry picked from commit 8f11388f4e)
Signed-off-by: Peter Korsgaard <peter@korsgaard.com>
DHCP package may silently fail to install binaries to the target image.
The problem occurs when buildroot output/host and build server provide
different flavors of awk. For instance, mawk on build server and gawk
in buildroot output/host. In this case isc-dhcp configure script detects
gawk in output/host and generates Makefiles specifying gawk without
absolute path. During Buildroot installation phase, those Makefiles
are used to install dhcp binaries. They attempt to use gawk without
absolute path. However build host does not have gawk.
To resolve the issue add host-gawk to dependencies and specify absolute
path to host-gawk in dhcp configure script using DHCP_CONF_ENV.
Signed-off-by: Sergey Matyukevich <geomatsi@gmail.com>
Signed-off-by: Arnout Vandecappelle (Essensium/Mind) <arnout@mind.be>
(cherry picked from commit 9ec60e877e)
Signed-off-by: Peter Korsgaard <peter@korsgaard.com>
Commit a8fbe67b9b ("package/wpa_supplicant: add upstream patch to fix
CVE-2021-30004") added security patch from hostapd upstream without
required ASN.1 helpers. Backport and adapt two commits from the
hostapd upstream to add missing headers and helpers.
Signed-off-by: Sergey Matyukevich <geomatsi@gmail.com>
Signed-off-by: Yann E. MORIN <yann.morin.1998@free.fr>
(cherry picked from commit 0c65499c3f)
Signed-off-by: Peter Korsgaard <peter@korsgaard.com>
On hosts where gawk is not available, it is not possible to build the
package with server option (BR2_PACKAGE_DHCP_SERVER).
The build goes through without errors but the binaries are not created
and installed. The reason is that autotools cannot find gawk.
Fixes: Bug 13781
Reported-by: Kay Jeschonneck <kay.jeschonneck@airbus.com>
Signed-off-by: Heiko Thiery <heiko.thiery@gmail.com>
Signed-off-by: Arnout Vandecappelle (Essensium/Mind) <arnout@mind.be>
(cherry picked from commit 085d20e5e6)
Signed-off-by: Peter Korsgaard <peter@korsgaard.com>
Commit d65586f45a ("package/hostapd: add upstream patch to fix
CVE-2021-30004") added security patch from hostapd upstream without
required ASN.1 helpers. Backport and adapt two commits from the
hostapd upstream to add missing headers and helpers.
Fixes:
http://autobuild.buildroot.net/results/8f56cf556efbf447633ce873a21635f5adbc3cd2/
Signed-off-by: Sergey Matyukevich <geomatsi@gmail.com>
[yann.morin.1998@free.fr: slightly reformat the patches]
Signed-off-by: Yann E. MORIN <yann.morin.1998@free.fr>
(cherry picked from commit 75496165dc)
Signed-off-by: Peter Korsgaard <peter@korsgaard.com>
libraw needs __sync_fetch_and_add since version 0.20.0 and
d1975cb0e0
This will fix the following build failure with imagemagick which is
raised since commit 2f47cfade4:
/home/buildroot/autobuild/run/instance-0/output-1/host/opt/ext-toolchain/bin/../lib/gcc/sparc-buildroot-linux-uclibc/9.3.0/../../../../sparc-buildroot-linux-uclibc/bin/ld: /home/buildroot/autobuild/run/instance-0/output-1/host/sparc-buildroot-linux-uclibc/sysroot/usr/lib/libraw_r.so: undefined reference to `__sync_fetch_and_add_4'
Fixes:
- http://autobuild.buildroot.org/results/900df43bd418d2da0c3ec875db1c5564dd857e94
Signed-off-by: Fabrice Fontaine <fontaine.fabrice@gmail.com>
Signed-off-by: Yann E. MORIN <yann.morin.1998@free.fr>
(cherry picked from commit edb32a03b5)
Signed-off-by: Peter Korsgaard <peter@korsgaard.com>
The examples require libstdc++.so.6 so add the required dependency to
the Config.in.
./tiger: error while loading shared libraries: libstdc++.so.6: cannot open shared object file: No such file or directory
Signed-off-by: Heiko Thiery <heiko.thiery@gmail.com>
Signed-off-by: Yann E. MORIN <yann.morin.1998@free.fr>
(cherry picked from commit 3d78dbace2)
Signed-off-by: Peter Korsgaard <peter@korsgaard.com>
Disable -Werror to fix the following build failure with gcc 11:
/data/buildroot-autobuilder/instance-0/output-1/build/host-flatcc-0.6.0/include/flatcc/reflection/flatbuffers_common_builder.h: In function 'flatbuffers_char_array_copy_from_pe':
/data/buildroot-autobuilder/instance-0/output-1/build/host-flatcc-0.6.0/include/flatcc/reflection/flatbuffers_common_builder.h:341:3: error: this 'for' clause does not guard... [-Werror=misleading-indentation]
341 | for (i = 0; i < n; ++i) N ## _copy_from_pe(&p[i], &p2[i]); return p; }\
| ^~~
An other option would have been to retrieve the following upstream
commit:
f8c4140dd9
but disabling -Werror is more future-proof
Fixes:
- http://autobuild.buildroot.org/results/4d5cdddbfeefdeb943234b76eb08b04376f3c36d
Signed-off-by: Fabrice Fontaine <fontaine.fabrice@gmail.com>
Signed-off-by: Yann E. MORIN <yann.morin.1998@free.fr>
(cherry picked from commit 1beb978492)
Signed-off-by: Peter Korsgaard <peter@korsgaard.com>
Order of the `sed` expressions is important; when this was commited
to master, the order of the expressions from the original patch [1] was
changed, rendering the second expression to noop.
This made all the environment variables from the script to contain
absolute paths: long absolute paths makes verbose builds difficult
to read/follow.
We can take advantage of the fact that the PATH is updated and we
don't have to use absolute paths.
Fixed by reordering the `sed` expresions:
* first update the path of the binaries: e.g. 's%$(HOST_DIR)/bin/%%g'
* only then update remaining paths: e.g. 's%$(HOST_DIR)%\$$SDK_PATH%g'
[1] https://patchwork.ozlabs.org/project/buildroot/patch/20201027140140.47982-1-matthew.weber@rockwellcollins.com/
Signed-off-by: Mircea GLIGA <mgliga@bitdefender.com>
Signed-off-by: Arnout Vandecappelle (Essensium/Mind) <arnout@mind.be>
(cherry picked from commit d0ed2725e9)
Signed-off-by: Peter Korsgaard <peter@korsgaard.com>
Fixes the following security issues:
- CVE-2020-8696: Description: Improper removal of sensitive information
before storage or transfer in some Intel(R) Processors may allow an
authenticated user to potentially enable information disclosure via local
access
- CVE-2020-8698: Description: Improper isolation of shared resources in some
Intel(R) Processors may allow an authenticated user to potentially enable
information disclosure via local access
https://www.intel.com/content/www/us/en/security-center/advisory/intel-sa-00381.html
License file updated with the new year, so change hash accordingly.
Signed-off-by: Peter Korsgaard <peter@korsgaard.com>
[yann.morin.1998@free.fr: explain license hash change]
Signed-off-by: Yann E. MORIN <yann.morin.1998@free.fr>
(cherry picked from commit e87d5f643b)
Signed-off-by: Peter Korsgaard <peter@korsgaard.com>
From the release notes:
================================================================================
Redis 6.0.13 Released Mon May 3 19:00:00 IST 2021
================================================================================
Upgrade urgency: SECURITY, Contains fixes to security issues that affect
authenticated client connections. LOW otherwise.
See https://github.com/redis/redis/blob/6.0.13/00-RELEASENOTES
Signed-off-by: Titouan Christophe <titouanchristophe@gmail.com>
Signed-off-by: Peter Korsgaard <peter@korsgaard.com>
Fix CVE-2021-21252: The jQuery Validation Plugin provides drop-in
validation for your existing forms. It is published as an npm package
"jquery-validation". jquery-validation before version 1.19.3 contains
one or more regular expressions that are vulnerable to ReDoS (Regular
Expression Denial of Service).
Update hash of README.md due to changes not related to license
https://github.com/jquery-validation/jquery-validation/releases/tag/1.19.3
Signed-off-by: Fabrice Fontaine <fontaine.fabrice@gmail.com>
Signed-off-by: Yann E. MORIN <yann.morin.1998@free.fr>
(cherry picked from commit ae79f0f403)
Signed-off-by: Peter Korsgaard <peter@korsgaard.com>
Security
========
* sshd(8): OpenSSH 8.5 introduced the LogVerbose keyword. When this
option was enabled with a set of patterns that activated logging
in code that runs in the low-privilege sandboxed sshd process, the
log messages were constructed in such a way that printf(3) format
strings could effectively be specified the low-privilege code.
An attacker who had sucessfully exploited the low-privilege
process could use this to escape OpenSSH's sandboxing and attack
the high-privilege process. Exploitation of this weakness is
highly unlikely in practice as the LogVerbose option is not
enabled by default and is typically only used for debugging. No
vulnerabilities in the low-privilege process are currently known
to exist.
https://www.openssh.com/txt/release-8.6
Signed-off-by: Fabrice Fontaine <fontaine.fabrice@gmail.com>
Signed-off-by: Yann E. MORIN <yann.morin.1998@free.fr>
(cherry picked from commit 12916827e0)
Signed-off-by: Peter Korsgaard <peter@korsgaard.com>
Add two upstream patches fixing host gcc-11.x compile.
Fixes:
- https://bugs.busybox.net/show_bug.cgi?id=13806
In file included from ../include/pthread.h:1,
from ../sysdeps/nptl/thread_db.h:25,
from ../nptl/descr.h:32,
from ../sysdeps/x86_64/nptl/tls.h:130,
from ../sysdeps/generic/libc-tsd.h:44,
from ./localeinfo.h:224,
from programs/ld-ctype.c:37:
../sysdeps/nptl/pthread.h:734:47: error: argument 1 of type ‘struct __jmp_buf_tag *’ declared as a pointer [-Werror=array-parameter=]
734 | extern int __sigsetjmp (struct __jmp_buf_tag *__env, int __savemask) __THROWNL;
| ~~~~~~~~~~~~~~~~~~~~~~^~~~~
In file included from ../include/setjmp.h:2,
from ../nptl/descr.h:24,
from ../sysdeps/x86_64/nptl/tls.h:130,
from ../sysdeps/generic/libc-tsd.h:44,
from ./localeinfo.h:224,
from programs/ld-ctype.c:37:
../setjmp/setjmp.h:54:46: note: previously declared as an array ‘struct __jmp_buf_tag[1]’
54 | extern int __sigsetjmp (struct __jmp_buf_tag __env[1], int __savemask) __THROWNL;
| ~~~~~~~~~~~~~~~~~~~~~^~~~~~~~
Signed-off-by: Peter Seiderer <ps.report@gmx.net>
Signed-off-by: Yann E. MORIN <yann.morin.1998@free.fr>
(cherry picked from commit 4174f79a57)
Signed-off-by: Peter Korsgaard <peter@korsgaard.com>
Fixes the following security issues:
- CVE-2021-32918: DoS via insufficient memory consumption controls
It was discovered that default settings leave Prosody susceptible to
remote unauthenticated denial-of-service (DoS) attacks via memory
exhaustion when running under Lua 5.2 or Lua 5.3. Lua 5.2 is the default
and recommended Lua version for Prosody 0.11.x series.
- CVE-2021-32920: DoS via repeated TLS renegotiation causing excessive CPU
consumption
It was discovered that Prosody does not disable SSL/TLS renegotiation,
even though this is not used in XMPP. A malicious client may flood a
connection with renegotiation requests to consume excessive CPU resources
on the server.
- CVE-2021-32921: Use of timing-dependent string comparison with sensitive
values
It was discovered that Prosody does not use a constant-time algorithm for
comparing certain secret strings when running under Lua 5.2 or later.
This can potentially be used in a timing attack to reveal the contents of
secret strings to an attacker.
- CVE-2021-32917: Use of mod_proxy65 is unrestricted in default
configuration
mod_proxy65 is a file transfer proxy provided with Prosody to facilitate
the transfer of files and other data between XMPP clients.
It was discovered that the proxy65 component of Prosody allows open access
by default, even if neither of the users have an XMPP account on the local
server, allowing unrestricted use of the server’s bandwidth.
- CVE-2021-32919: Undocumented dialback-without-dialback option insecure
The undocumented option ‘dialback_without_dialback’ enabled an
experimental feature for server-to-server authentication. A flaw in this
feature meant it did not correctly authenticate remote servers, allowing a
remote server to impersonate another server when this option is enabled.
For more details, see the advisory:
https://prosody.im/security/advisory_20210512/
Signed-off-by: Peter Korsgaard <peter@korsgaard.com>
(cherry picked from commit 9c108afab8)
Signed-off-by: Peter Korsgaard <peter@korsgaard.com>
Extend docker_compose_test() to expose /bin on the host to the container
through a volume mount and verify that /bin/busybox can be downloaded and
contains the right data.
Signed-off-by: Peter Korsgaard <peter@korsgaard.com>
(cherry picked from commit aa31d10808)
Signed-off-by: Peter Korsgaard <peter@korsgaard.com>
Extend docker_test() to expose a random (8888) port to verify that doesn't
fail, and extend the docker-compose test to run the busybox httpd in the
background, expose that as port 80 and verify that /etc/resolv.conf could be
fetched by wget.
Signed-off-by: Peter Korsgaard <peter@korsgaard.com>
(cherry picked from commit 4915b692c8)
Signed-off-by: Peter Korsgaard <peter@korsgaard.com>
docker-engine 20.10.6 broke container port forwarding for hosts without IPv6
support:
docker: Error response from daemon: driver failed programming external
connectivity on endpoint naughty_moore
(038e9ed4b5ea77e1c52462d6d04ad001fbad9beb185a6511aadc217c8a271608): Error
starting userland proxy: listen tcp6 [::]:80: socket: address family not
supported by protocol.
Add a libnetwork patch from an upstream pull request to fix this, after
adjusting the patch to apply to docker-engine (which has libnetwork vendored
under vendor/github.com/docker/libnetwork):
- https://github.com/moby/libnetwork/pull/2635,
- https://github.com/moby/moby/pull/42322
Signed-off-by: Peter Korsgaard <peter@korsgaard.com>
(cherry picked from commit 2fd33900f5)
Signed-off-by: Peter Korsgaard <peter@korsgaard.com>
Fix CVE-2021-28899: Vulnerability in the
AC3AudioFileServerMediaSubsession, ADTSAudioFileServerMediaSubsession,
and AMRAudioFileServerMediaSubsessionLive OnDemandServerMediaSubsession
subclasses in Networks LIVE555 Streaming Media before 2021.3.16.
http://live555.com/liveMedia/public/changelog.txt
Signed-off-by: Fabrice Fontaine <fontaine.fabrice@gmail.com>
Signed-off-by: Peter Korsgaard <peter@korsgaard.com>
(cherry picked from commit 6ad1c7f12e)
Signed-off-by: Peter Korsgaard <peter@korsgaard.com>
OpenTyrian was previously managed in a Mercurial repository hosted on
Bitbucket. Mid-2020, Bitbucket shut off all its Mercurial repositories:
https://bitbucket.org/blog/sunsetting-mercurial-support-in-bitbucket
Since then, OpenTyrian's source code is inacessible, but we have had no
build failure associated as there is an old archive hosted on s.b.o, so
that all builds fallback to downloading that:
http://sources.buildroot.net/opentyrian/opentyrian-9c9f0ec3532b.tar.gz
However, the project has been revived (kinda) on github:
https://github.com/opentyrian/opentyrian
Git commit cf5dbeb69eebd9ef9afc4473088d9469b79589eb has been found to
be the closest, both in content and date, to the Mercuail reference
9c9f0ec3532b we were using. The only deltas are in Mercurial-specific
files:
b/.hg_archival.txt | 5 0 5 0 -----
b/.hgtags | 2 1 1 0 +-
2 files changed, 1 insertion(+), 6 deletions(-)
While at it, add a hash file.
Signed-off-by: Yann E. MORIN <yann.morin.1998@free.fr>
Cc: Julien Boibessot <julien.boibessot@armadeus.com>
Signed-off-by: Peter Korsgaard <peter@korsgaard.com>
(cherry picked from commit 64e7c63528)
Signed-off-by: Peter Korsgaard <peter@korsgaard.com>
The comment dependencies need to be the inverse of the package
dependencies (fixes comment shown in menuconfig even if the package
is available).
Signed-off-by: Peter Seiderer <ps.report@gmx.net>
Signed-off-by: Peter Korsgaard <peter@korsgaard.com>
(cherry picked from commit 03a8d70f52)
Signed-off-by: Peter Korsgaard <peter@korsgaard.com>
When building host-cryptsetup, if tmpfiles.d support is enabled then the
install step tries to install /usr/lib/tmpfiles.d/cryptsetup.conf
globally on the host system.
Even if the tmpfiles.d config were installed correctly in the host
directory, nothing would ever run these rules, so disable this feature
via configure.
Signed-off-by: John Keeping <john@metanate.com>
Signed-off-by: Peter Korsgaard <peter@korsgaard.com>
(cherry picked from commit b2e82f9fa5)
Signed-off-by: Peter Korsgaard <peter@korsgaard.com>
Fixes the following security issues:
- CVE-2021-31525: ReadRequest and ReadResponse in net/http can hit an
unrecoverable panic when reading a very large header (over 7MB on 64-bit
architectures, or over 4MB on 32-bit ones). Transport and Client are
vulnerable and the program can be made to crash by a malicious server.
Server is not vulnerable by default, but can be if the default max header
of 1MB is overridden by setting Server.MaxHeaderBytes to a higher value,
in which case the program can be made to crash by a malicious client.
https://github.com/golang/go/issues/45710
Signed-off-by: Peter Korsgaard <peter@korsgaard.com>
Fixes the following security issues:
- bpo-43434: Creating a sqlite3.Connection object now also produces a
sqlite3.connect auditing event. Previously this event was only produced
by sqlite3.connect() calls. Patch by Erlend E. Aasland.
- bpo-43882: The presence of newline or tab characters in parts of a URL
could allow some forms of attacks.
Following the controlling specification for URLs defined by WHATWG
urllib.parse() now removes ASCII newlines and tabs from URLs, preventing
such attacks.
- bpo-43472: Ensures interpreter-level audit hooks receive the
cpython.PyInterpreterState_New event when called through the
_xxsubinterpreters module.
- bpo-36384: ipaddress module no longer accepts any leading zeros in IPv4
address strings. Leading zeros are ambiguous and interpreted as octal
notation by some libraries. For example the legacy function
socket.inet_aton() treats leading zeros as octal notatation. glibc
implementation of modern inet_pton() does not accept any leading zeros.
For a while the ipaddress module used to accept ambiguous leading zeros.
- bpo-43075: Fix Regular Expression Denial of Service (ReDoS) vulnerability
in urllib.request.AbstractBasicAuthHandler. The ReDoS-vulnerable regex
has quadratic worst-case complexity and it allows cause a denial of
service when identifying crafted invalid RFCs. This ReDoS issue is on the
client side and needs remote attackers to control the HTTP server.
- bpo-42800: Audit hooks are now fired for frame.f_code, traceback.tb_frame,
and generator code/frame attribute access.
https://www.python.org/downloads/release/python-395/
Signed-off-by: Peter Korsgaard <peter@korsgaard.com>
(cherry picked from commit f02c0ee1b0)
Signed-off-by: Peter Korsgaard <peter@korsgaard.com>
Django 3.0.x is EOL, so move to 3.2.x which is the new LTS release. For
details of the changes and update instructions, see the announcement:
https://www.djangoproject.com/weblog/2021/apr/06/django-32-released/
Fixes the following security issues:
- CVE-2021-30459 - SQL Injection via Select, Explain and Analyze forms of
the SQLPanel for Django Debug Toolbar >= 0.10.0
With Django Debug Toolbar 0.10.0 and above, attackers are able to execute
SQL by changing the raw_sql input of the SQL explain, analyze or select
forms and submitting the form. This is a high severity issue for anyone
using the toolbar in a production environment. Generally the Django Debug
Toolbar team only maintains the latest version of django-debug-toolbar,
but an exception was made because of the high severity of this issue.
The GitHub Security Advisory can be found here:
https://github.com/jazzband/django-debug-toolbar/security/advisories/GHSA-pghf-347x-c2gj
- CVE-2021-31542: Potential directory-traversal via uploaded files
MultiPartParser, UploadedFile, and FieldFile allowed directory-traversal
via uploaded files with suitably crafted file names.
In order to mitigate this risk, stricter basename and path sanitation is
now applied. Specifically, empty file names and paths with dot segments
will be rejected.
This issue has low severity, according to the Django security policy.
- CVE-2021-32052: Header injection possibility since URLValidator accepted
newlines in input on Python 3.9.5+
On Python 3.9.5+, URLValidator didn't prohibit newlines and tabs. If you
used values with newlines in HTTP response, you could suffer from header
injection attacks. Django itself wasn't vulnerable because HttpResponse
prohibits newlines in HTTP headers.
Moreover, the URLField form field which uses URLValidator silently removes
newlines and tabs on Python 3.9.5+, so the possibility of newlines
entering your data only existed if you are using this validator outside of
the form fields.
This issue was introduced by the bpo-43882 fix.
Signed-off-by: Peter Korsgaard <peter@korsgaard.com>
(cherry picked from commit 84441433ec)
Signed-off-by: Peter Korsgaard <peter@korsgaard.com>
Sometimes, post-build or post-image scripts need to reinvoke
Buildroot's make, for example to execute "make printvars".
However, so far post-build/image/fakeroot can't trivially run printvars
in a way that worked for both in-tree and out-of-tree builds. Indeed:
* "make printvars" would work for in-tree builds, but not out of tree
builds
* "make -C ${O} printvars" would work for out-of-tree builds, but not
in-tree builds
* "make -C ${BR2_CONFIG%/*} printvars" works in both cases, but it is
a bit cryptic, and two maintainers did not even immediately think of
it
In order to solve this, this commit exposes $(CONFIG_DIR) to
post-build/image/fakeroot scripts, through the EXTRA_ENV variable.
The documentation is updated accordingly.
Signed-off-by: Thomas Petazzoni <thomas.petazzoni@bootlin.com>
[yann.morin.1998@free.fr:
- reference BR2_CONFIG as an exemple
- slightly reword the commit log accordingly
- move the doc for CONFIG_DIR next to that of BR2_CONFIG
]
Signed-off-by: Yann E. MORIN <yann.morin.1998@free.fr>
(cherry picked from commit efdcd651bf)
Signed-off-by: Peter Korsgaard <peter@korsgaard.com>
This will fix a build failure with gcc 10
- Update indentation in hash file (two spaces)
- Drop INSTALL_SYSCONFDIR, INSTALL_WEBROOTDIR and WITH_SYSTEM_MALLOC
(not available since
df145932e3)
- Set WITHOUT_HEADERS to ON because headers are not needed and to avoid
the following build failure:
CMake Error at include/cmake_install.cmake:46 (file):
file INSTALL cannot find
"/home/fabrice/buildroot/output/build/monkey-f54856ce250c4e25735434dc75717a4b7fbfc45b/include/mk_core.h":
No such file or directory.
Call Stack (most recent call first):
cmake_install.cmake:69 (include)
Upstream is aware than the lack of release is an issue but no comments
since 2018: https://github.com/monkey/monkey/issues/276
Fixes:
- http://autobuild.buildroot.org/results/0b723937ca048228082d040100f6e6324ac8300b
Signed-off-by: Fabrice Fontaine <fontaine.fabrice@gmail.com>
Signed-off-by: Arnout Vandecappelle (Essensium/Mind) <arnout@mind.be>
(cherry picked from commit 26a7d912f4)
Signed-off-by: Peter Korsgaard <peter@korsgaard.com>
Kernel 4.16.7 is old enough to produce the "multiple definition of `yylloc'"
error which is fixed in newer versions.
Bump the test kernel version from 4.16.7 to 5.10.34 to prevent this error wwhen
building the test image.
Signed-off-by: Adam Duskett <aduskett@gmail.com>
Signed-off-by: Yann E. MORIN <yann.morin.1998@free.fr>
(cherry picked from commit ab2d472cde)
Signed-off-by: Peter Korsgaard <peter@korsgaard.com>
Fixes:
.../x86_64-buildroot-linux-gnu/bin/ld: .../host/x86_64-buildroot-linux-gnu/sysroot/usr/lib/libtomcrypt.a(md5.o): relocation R_X86_64_32 against `.rodata.str1.1' can not be used when making a shared object; recompile with -fPIC
when building a shared library that links with libtomcrypt. Our only
internal user dropbear doesn't do this, so there are no autobuilder
failures.
Signed-off-by: Peter Seiderer <ps.report@gmx.net>
Signed-off-by: Arnout Vandecappelle (Essensium/Mind) <arnout@mind.be>
(cherry picked from commit ec2ee79ec1)
Signed-off-by: Peter Korsgaard <peter@korsgaard.com>
kexec build will fail on older kernels (pre 4.4) as the define VIDEO_CAPABILITY_64BIT_BASE was not present at that time.
This patch adds it, as per linux/include/uapi/linux/screen_info.h, if not present.
Signed-off-by: Federico Pellegrin <fede@evolware.org>
Signed-off-by: Peter Korsgaard <peter@korsgaard.com>
Fixes various networking issues:
- Fix a regression in docker 20.10, causing IPv6 addresses no longer to be
bound by default when mapping ports moby/moby#42205
- Fix implicit IPv6 port-mappings not included in API response. Before
docker 20.10, published ports were accessible through both IPv4 and IPv6
by default, but the API only included information about the IPv4 (0.0.0.0)
mapping moby/moby#42205
- Fix a regression in docker 20.10, causing the docker-proxy to not be
terminated in all cases moby/moby#42205
- Fix iptables forwarding rules not being cleaned up upon container removal
moby/moby#42205
For more details, see the release notes:
https://docs.docker.com/engine/release-notes/#20106
Signed-off-by: Mario Fink <knif.oiram@gmail.com>
Tested-by: Christian Stewart <christian@paral.in>
Signed-off-by: Peter Korsgaard <peter@korsgaard.com>
(cherry picked from commit e1458fe943)
Signed-off-by: Peter Korsgaard <peter@korsgaard.com>
- update home page URL to https
Signed-off-by: Peter Seiderer <ps.report@gmx.net>
Signed-off-by: Arnout Vandecappelle (Essensium/Mind) <arnout@mind.be>
(cherry picked from commit 27b30ee742)
Signed-off-by: Peter Korsgaard <peter@korsgaard.com>
Drop first patch and pass -fPIC to configure to fix the following build
failure on ARC:
ERROR: architecture for "/usr/lib/libdmalloc.so" is "ARCompact", should be "ARCv2"
ERROR: architecture for "/usr/lib/libdmallocth.so" is "ARCompact", should be "ARCv2"
ERROR: architecture for "/usr/lib/libdmallocthcxx.so" is "ARCompact", should be "ARCv2"
ERROR: architecture for "/usr/lib/libdmallocxx.so" is "ARCompact", should be "ARCv2"
This build failure is due to the following configure error:
checking shared library link args... ./configure: line 4467: 10229 Segmentation fault ( ${LD-ld} -shared --whole-archive -soname conftest.so -o conftest.so.t conftest.a ) 2>&5
/home/buildroot/autobuild/run/instance-0/output-1/host/bin/arc-buildroot-linux-gnu-ld -G -o $@.t
This configure error is due to missing -fPIC:
configure:4392: checking shared library link args
configure:4398: /home/buildroot/autobuild/run/instance-0/output-1/host/bin/arc-buildroot-linux-gnu-gcc -c -D_LARGEFILE_SOURCE -D_LARGEFILE64_SOURCE -D_FILE_OFFSET_BITS=64 -Os -g2 -D_LARGEFILE_SOURCE -D_LARGEFILE64_SOURCE -D_FILE_OFFSET_BITS=64 conftest.c >&5
configure:4404: $? = 0
configure:4408: test -z
|| test ! -s conftest.err
configure:4411: $? = 0
configure:4414: test -s conftest.o
configure:4417: $? = 0
/home/buildroot/autobuild/run/instance-0/output-1/host/bin/arc-buildroot-linux-gnu-ld: conftest.a(conftest.o): relocation R_ARC_32_ME against `__stack_chk_guard' can not be used when making a shared object; recompile with -fPIC
/home/buildroot/autobuild/run/instance-0/output-1/host/bin/arc-buildroot-linux-gnu-ld: BFD (GNU Binutils) 2.33.50.20191002 assertion fail elf32-arc.c:1805
/home/buildroot/autobuild/run/instance-0/output-1/host/bin/arc-buildroot-linux-gnu-ld: unrecognized option '-all'
/home/buildroot/autobuild/run/instance-0/output-1/host/bin/arc-buildroot-linux-gnu-ld: use the --help option for usage information
configure:4475: result: /home/buildroot/autobuild/run/instance-0/output-1/host/bin/arc-buildroot-linux-gnu-ld -G -o $@.t
Fixes:
- http://autobuild.buildroot.org/results/65677d889c27649e1f3ca1f3b6c70df7c89779f6
Signed-off-by: Fabrice Fontaine <fontaine.fabrice@gmail.com>
Signed-off-by: Arnout Vandecappelle (Essensium/Mind) <arnout@mind.be>
(cherry picked from commit 19ec872f16)
Signed-off-by: Peter Korsgaard <peter@korsgaard.com>
The poppler package failed to build for me with errors such as this one:
host/aarch64-buildroot-linux-gnu/include/c++/10.3.0/cstdlib:75:15: fatal error: stdlib.h: No such file or directory
75 | #include_next <stdlib.h>
| ^~~~~~~~~~
Changing the CMake option to a link-specific one fixes the issue.
Also change other packages with the same issue: cutelyst, gerbera,
kf5-modemmanager-qt, kodi and wampcc.
Signed-off-by: Gleb Mazovetskiy <glex.spb@gmail.com>
Signed-off-by: Arnout Vandecappelle (Essensium/Mind) <arnout@mind.be>
(cherry picked from commit 7333207eaf)
Signed-off-by: Peter Korsgaard <peter@korsgaard.com>
Fixes the following security issues:
- A malformed incoming IXFR transfer could trigger an assertion failure in
named, causing it to quit abnormally. (CVE-2021-25214)
- named crashed when a DNAME record placed in the ANSWER section during
DNAME chasing turned out to be the final answer to a client query.
(CVE-2021-25215)
- When a server's configuration set the tkey-gssapi-keytab or
tkey-gssapi-credential option, a specially crafted GSS-TSIG query could
cause a buffer overflow in the ISC implementation of SPNEGO (a protocol
enabling negotiation of the security mechanism used for GSSAPI
authentication). This flaw could be exploited to crash named binaries
compiled for 64-bit platforms, and could enable remote code execution when
named was compiled for 32-bit platforms. (CVE-2021-25216)
For more details, see the release notes:
https://downloads.isc.org/isc/bind9/9.11.31/RELEASE-NOTES-bind-9.11.31.html
Signed-off-by: Peter Korsgaard <peter@korsgaard.com>
Signed-off-by: Yann E. MORIN <yann.morin.1998@free.fr>
(cherry picked from commit 862609b389)
Signed-off-by: Peter Korsgaard <peter@korsgaard.com>
Update patch added by commit 183d583fb5 to
use pkg-config instead of linking with zlib to fix the following static
build failure with a bzip2-enabled libmagic:
/home/buildroot/autobuild/instance-1/output-1/host/opt/ext-toolchain/bin/../lib/gcc/arc-buildroot-linux-uclibc/9.3.1/../../../../arc-buildroot-linux-uclibc/bin/ld: /home/buildroot/autobuild/instance-1/output-1/host/arc-buildroot-linux-uclibc/sysroot/usr/lib/libmagic.a(compress.o): in function `uncompressbuf':
compress.c:(.text+0x422): undefined reference to `BZ2_bzDecompressInit'
/home/buildroot/autobuild/instance-1/output-1/host/opt/ext-toolchain/bin/../lib/gcc/arc-buildroot-linux-uclibc/9.3.1/../../../../arc-buildroot-linux-uclibc/bin/ld: compress.c:(.text+0x422): undefined reference to `BZ2_bzDecompressInit'
Fixes:
- http://autobuild.buildroot.org/results/4c511c02e4c63b35ecf77a2658f88e8a0d9dbb4d
Signed-off-by: Fabrice Fontaine <fontaine.fabrice@gmail.com>
Signed-off-by: Arnout Vandecappelle (Essensium/Mind) <arnout@mind.be>
(cherry picked from commit c5f3c6ff1a)
Signed-off-by: Peter Korsgaard <peter@korsgaard.com>
Commit 5871e278f8 (package/openjdk{, -bin}: security bump to version
11.0.11_9) forgot to account for the openjdk patch in the versioned
directory.
That patch was a collection of backports from upstream ,that are now all
present in 11.0.11+9, so drop that patch.
Fixes: 5871e278f8
Reported-by: Adam Duskett <aduskett@gmail.com>
Signed-off-by: Yann E. MORIN <yann.morin.1998@free.fr>
Cc: Peter Korsgaard <peter@korsgaard.com>
Signed-off-by: Peter Korsgaard <peter@korsgaard.com>
(cherry picked from commit bc2e555eb1)
Signed-off-by: Peter Korsgaard <peter@korsgaard.com>
As recently discussed on the list:
http://lists.busybox.net/pipermail/buildroot/2021-April/308373.html
Packages like mkpimage where the source code is included in the Buildroot
tree, currently doesn't use an extract step (which also skips the patch
step), so they cannot be patched by a patch in BR2_GLOBAL_PATCH_DIR (or the
pkgdir), which is a bit confusing.
As a fix, add a simple extract step that copies the source file to the build
directory, so the patch step gets run as well.
Signed-off-by: Peter Korsgaard <peter@korsgaard.com>
(cherry picked from commit 89d4e1ccdb)
Signed-off-by: Peter Korsgaard <peter@korsgaard.com>
As recently discussed on the list:
http://lists.busybox.net/pipermail/buildroot/2021-April/308373.html
Packages like mkpasswd where the source code is included in the Buildroot
tree, currently doesn't use an extract step (which also skips the patch
step), so they cannot be patched by a patch in BR2_GLOBAL_PATCH_DIR (or the
pkgdir), which is a bit confusing.
As a fix, add a simple extract step that copies the source files to the
build directory, so the patch step gets run as well.
Signed-off-by: Peter Korsgaard <peter@korsgaard.com>
(cherry picked from commit a052e6e883)
Signed-off-by: Peter Korsgaard <peter@korsgaard.com>
As recently discussed on the list:
http://lists.busybox.net/pipermail/buildroot/2021-April/308373.html
Packages like makedevs where the source code is included in the Buildroot
tree, currently doesn't use an extract step (which also skips the patch
step), so they cannot be patched by a patch in BR2_GLOBAL_PATCH_DIR (or the
pkgdir), which is a bit confusing.
As a fix, add a simple extract step that copies the source file to the build
directory, so the patch step gets run as well.
Signed-off-by: Peter Korsgaard <peter@korsgaard.com>
(cherry picked from commit c3355e31d2)
Signed-off-by: Peter Korsgaard <peter@korsgaard.com>
Fixes the following security issue for the internal TLS backend:
- CVE-2021-30004: In wpa_supplicant and hostapd 2.9, forging attacks may
occur because AlgorithmIdentifier parameters are mishandled in tls/pkcs1.c
and tls/x509v3.c.
Signed-off-by: Peter Korsgaard <peter@korsgaard.com>
(cherry picked from commit a8fbe67b9b)
Signed-off-by: Peter Korsgaard <peter@korsgaard.com>
Fixes the following security issue for the internal TLS backend:
- CVE-2021-30004: In wpa_supplicant and hostapd 2.9, forging attacks may
occur because AlgorithmIdentifier parameters are mishandled in tls/pkcs1.c
and tls/x509v3.c.
Signed-off-by: Peter Korsgaard <peter@korsgaard.com>
(cherry picked from commit d65586f45a)
Signed-off-by: Peter Korsgaard <peter@korsgaard.com>
Build of http::sconesite::image module was silently broken until commit
d3b818c3cf
However, sconeserver fails to build with ImageMagick because:
- it checks for ImageMagick++.pc instead of ImageMagick.pc
- it uses the transform function which has been removed from the public
API since version 7.0.1-0 and
06f590165f
As sconeserver does not seem to be maintained anymore, drop
BR2_PACKAGE_SCONESERVER_HTTP_SCONESITE_IMAGE.
Fixes:
- http://autobuild.buildroot.org/results/895ab582d1140f7677fc1c6934fa2e0c47c49f20
Signed-off-by: Fabrice Fontaine <fontaine.fabrice@gmail.com>
Signed-off-by: Arnout Vandecappelle (Essensium/Mind) <arnout@mind.be>
[Arnout: add legacy symbol. It costs us exactly nothing, and if someone
actually had that selected, they know what's going on.]
(cherry picked from commit fdb6fc2b4a)
Signed-off-by: Peter Korsgaard <peter@korsgaard.com>
Let's use the _BUG_ form for disabling this package instead of BR2_nios2
architecture as we already use it for other packages.
Propagate this dependency to postgis. Also add the missing dependency on
bug 21464 to postgis.
Signed-off-by: Giulio Benetti <giulio.benetti@benettiengineering.com>
Signed-off-by: Arnout Vandecappelle (Essensium/Mind) <arnout@mind.be>
[Arnout:
- put 27597 after 21464 instead of before it;
- propagate dependency to postgis;
- mention the bugs in the comments.
]
(cherry picked from commit 72eba37e52)
[Peter: drop postgis logic, not in 2021.02.x]
Signed-off-by: Peter Korsgaard <peter@korsgaard.com>
Since its introduction in commit
b05e74ff92 in 2013, numactl has had an
explicit list of architectures that it supports. Interestingly, this
list does not include ARM, and now that rt-tests unconditionally needs
numactl, it meant the rt-tests package was no longer available on ARM.
Further investigation revealed that there is nothing in recent
versions of numactl that appears to be architecture-specific. It does
build with all of Buildroot toolchains currently used in the
autobuilders.
The only necessary changes are:
* Exclude no-MMU architectures, as madvise() is used in the code
base, and this is not available on no-MMU architectures.
* Make sure to use -latomic when needed, as some atomic operations
are used.
* Backport a patch that fixes the .symver usage, which only affects
really old gcc versions: only the old ARM Sourcery toolchain was
affected by this. Newer gcc versions support the gcc "symver"
attribute, so that the code that directly emits the assembly
.symver directive is not invoked.
With these changes, numactl builds successfully on all our supported
toolchains.
Signed-off-by: Thomas Petazzoni <thomas.petazzoni@bootlin.com>
Signed-off-by: Yann E. MORIN <yann.morin.1998@free.fr>
(cherry picked from commit 4ed540ddf5)
Signed-off-by: Peter Korsgaard <peter@korsgaard.com>
Commit a646cd27b1 (package/freescale-imx/imx-vpu: bump version to
5.4.39.3) somehow messed up when updating the hashes of the licene
files:
>>> imx-vpu 5.4.39.3 Collecting legal info
ERROR: EULA has wrong sha256 hash:
ERROR: expected: a39da2e94bd8b99eaac4325633854620ea3a55145259c3a7748c610a80714cfc
ERROR: got : 7ffad92e72e5f6b23027e7cf93a770a4acef00a92dcf79f22701ed401c5478c0
ERROR: Incomplete download, or man-in-the-middle (MITM) attack
ERROR: COPYING has wrong sha256 hash:
ERROR: expected: 69cbb76b3f10ac5a8c36f34df7bbdf50825815560c00a946fff2922365ef01a2
ERROR: got : 2ceab29de5ea533b86f570bcc4e9ddbfb5fe85a1da4978a8613ff3fd9bed781d
ERROR: Incomplete download, or man-in-the-middle (MITM) attack
The most probable cause is some confusion with imx-vpu-hantro, as the
faulty hashes reported above are those found in imx-vpu-hantro.
Signed-off-by: Sébastien Szymanski <sebastien.szymanski@armadeus.com>
[yann.morin.1998@free.fr: rewrite commit log with a probably reason]
Signed-off-by: Yann E. MORIN <yann.morin.1998@free.fr>
(cherry picked from commit 96142a5426)
Signed-off-by: Peter Korsgaard <peter@korsgaard.com>
https://security-tracker.debian.org/tracker/CVE-2019-6293https://github.com/NixOS/nixpkgs/issues/55386#issuecomment-683792976
"But this bug does not cause stack overflows in the generated code.
The function and file referred to in the bug (mark_beginning_as_normal
in nfa.c) are part of the flex code generator, not part of the
generated code. If flex crashes before generating any code, that
can hardly be a vulnerability. If flex does not crash, the generated
code is fine (or perhaps subject to other unreported bugs, who knows,
but the NFA has been generated correctly)."
Upstream has chosen to not provide a fix
https://github.com/westes/flex/issues/414
Signed-off-by: Matthew Weber <matthew.weber@rockwellcollins.com>
[yann.morin.1998@free.fr: use actual upstream URL]
Signed-off-by: Yann E. MORIN <yann.morin.1998@free.fr>
(cherry picked from commit 120d1241d8)
Signed-off-by: Peter Korsgaard <peter@korsgaard.com>
There had existed in one of the ISC BIND libraries a bug in a
function that was used by dhcpd when operating in DHCPv6 mode.
There was also a bug in dhcpd relating to the use of this function
per its documentation, but the bug in the library function
prevented this from causing any harm. All releases of dhcpd from
ISC contain copies of this, and other, BIND libraries in
combinations that have been tested prior to release and are known
to not present issues like this.
Affects: Builds of dhcpd versions prior to version 4.4.1 when
using BIND versions 9.11.2 or later.
https://cve.mitre.org/cgi-bin/cvename.cgi?name=CVE-2019-6470
Signed-off-by: Matthew Weber <matthew.weber@rockwellcollins.com>
Signed-off-by: Yann E. MORIN <yann.morin.1998@free.fr>
(cherry picked from commit 23fb8dd2d0)
Signed-off-by: Peter Korsgaard <peter@korsgaard.com>
We want bash to be installed as /bin/bash. For ages, Buildroot has
been doing this by overriding exec_prefix at install time. First of
all, it would be preferred to do this at configure time. But also,
overriding exec_prefix not only changes where "bash" goes, but also
where the pkgconfig file goes. Due to this, bash.pc goes into
/lib/pkgconfig/, and doesn't get removed by target-finalize.
Since all we want is to have 'bash' as /bin/bash, simply pass
--bindir=/bin at configure time. This allows to use the default target
installation logic for autotools-package. We keep a post-install
target hook to remove /bin/bashbug.
Signed-off-by: Thomas Petazzoni <thomas.petazzoni@bootlin.com>
Cc: Nicolas Cavallari <nicolas.cavallari@green-communications.fr>
Signed-off-by: Yann E. MORIN <yann.morin.1998@free.fr>
(cherry picked from commit 73aed53c82)
Signed-off-by: Peter Korsgaard <peter@korsgaard.com>
Fix vulnerability to DNS-rebind attacks.
This security fix addresses the same vulnerability isue which was reported
for libupnp (which libnpupnp is derived from) in CVE-2021-29462.
Signed-off-by: Jörg Krause <joerg.krause@embedded.rocks>
Signed-off-by: Thomas Petazzoni <thomas.petazzoni@bootlin.com>
(cherry picked from commit adea5b316e)
Signed-off-by: Peter Korsgaard <peter@korsgaard.com>
From https://www.lesbonscomptes.com/upmpdcli/pages/releases.html:
2021-03-13 libnpupnp 4.1.1
* Fix HEAD requests. Samsung TVs now work with Gerbera + libnpupnp
2021-03-13 libnpupnp 4.1.0
* Send SERVER and USER-AGENT headers in misc places where mandated or useful.
* Add API for the client code to set the user-agent and server string values
* Fix building and running with --disable-ipv6
* Misc portability fixes.
Signed-off-by: Jörg Krause <joerg.krause@embedded.rocks>
Signed-off-by: Thomas Petazzoni <thomas.petazzoni@bootlin.com>
(cherry picked from commit e1fa1334d0)
Signed-off-by: Peter Korsgaard <peter@korsgaard.com>
Bugfix release with important bugfixes:
https://github.com/timescale/timescaledb/releases/tag/2.0.2
This maintenance release contains bugfixes since the 2.0.1 release. We
deem it high priority for upgrading.
The bug fixes in this release address issues with joins, the status of
background jobs, and disabling compression. It also includes
enhancements to continuous aggregates, including improved validation
of policies and optimizations for faster refreshes when there are a
lot of invalidations.
Signed-off-by: Peter Korsgaard <peter@korsgaard.com>
The old at91bootstrap version (1.x) uses a strange variant of the BSD
license, called "BSD Source Code Attribution" and referenced by SPDX
as BSD-Source-Code.
Signed-off-by: Thomas Petazzoni <thomas.petazzoni@bootlin.com>
(cherry picked from commit 3887e8c095)
Signed-off-by: Peter Korsgaard <peter@korsgaard.com>
Fix CVE-2021-20305: A flaw was found in Nettle in versions before 3.7.2,
where several Nettle signature verification functions (GOST DSA, EDDSA &
ECDSA) result in the Elliptic Curve Cryptography point (ECC) multiply
function being called with out-of-range scalers, possibly resulting in
incorrect results. This flaw allows an attacker to force an invalid
signature, causing an assertion failure or possible validation. The
highest threat to this vulnerability is to confidentiality, integrity,
as well as system availability.
https://git.lysator.liu.se/nettle/nettle/-/blob/nettle_3.7.2_release_20210321/NEWS
Signed-off-by: Fabrice Fontaine <fontaine.fabrice@gmail.com>
Signed-off-by: Thomas Petazzoni <thomas.petazzoni@bootlin.com>
(cherry picked from commit ed653df573)
Signed-off-by: Peter Korsgaard <peter@korsgaard.com>
As of v8.2008 rsyslog no longer provides a default service file, and now
suggests using the platform suggested defaults. For Buildroot, install
the Debian service file which has been added in the same version,
however is not included in the official release.
Upstream commit which adds this service file:
cfd07503ba
Signed-off-by: Sam Voss <sam.voss@rockwellcollins.com>
Signed-off-by: Thomas Petazzoni <thomas.petazzoni@bootlin.com>
(cherry picked from commit 4732b78221)
Signed-off-by: Peter Korsgaard <peter@korsgaard.com>
ijson < 2.5 (as available in Debian 10) use the slow python backend by
default instead of the most efficient one available like modern ijson
versions, significantly slowing down cve checking. E.G.:
time ./support/scripts/pkg-stats --nvd-path ~/.nvd -p avahi --html foobar.html
Goes from
174,44s user 2,11s system 99% cpu 2:58,04 total
To
93,53s user 2,00s system 98% cpu 1:36,65 total
E.G. almost 2x as fast.
As a workaround, detect when the python backend is used and try to use a
more efficient one instead. Use the yajl2_cffi backend as recommended by
upstream, as it is most likely to work, and print a warning (and continue)
if we fail to load it.
The detection is slightly complicated by the fact that ijson.backends used
to be a reference to a backend module, but is nowadays a string (without the
ijson.backends prefix).
Signed-off-by: Peter Korsgaard <peter@korsgaard.com>
Signed-off-by: Yann E. MORIN <yann.morin.1998@free.fr>
(cherry picked from commit f31227e628)
Signed-off-by: Peter Korsgaard <peter@korsgaard.com>
Fixes:
showing "enable home daemon"
and "homed support needs a toolchain w/ threads, dynamic library, kernel headers >= 4.12"
when BR2_TOOLCHAIN_HEADERS_AT_LEAST_4_12
introduced by fa62b5165c
Signed-off-by: Michael Nosthoff <buildroot@heine.tech>
Signed-off-by: Yann E. MORIN <yann.morin.1998@free.fr>
(cherry picked from commit 5d4dc98c58)
Signed-off-by: Peter Korsgaard <peter@korsgaard.com>
Commit 841c695468 (libdrm: change to meson build system) converted the
autotools --disable-manpages to the neson -Dmanpages=false. However, the
actual option is 'man-pages':
WARNING: Unknown options: "manpages"
Signed-off-by: James Hilliard <james.hilliard1@gmail.com>
Reviewed-by: Peter Seiderer <ps.report@gmx.net>
[yann.morin.1998@free.fr: tweak commit log as per Peter's review]
Signed-off-by: Yann E. MORIN <yann.morin.1998@free.fr>
(cherry picked from commit 56fd68b688)
Signed-off-by: Peter Korsgaard <peter@korsgaard.com>
Enable introspection when GObject Introspection is enabled.
Signed-off-by: Einar Jon Gunnarsson <tolvupostur@gmail.com>
Acked-by: Aleksander Morgado <aleksander@aleksander.es>
[yann.morin.1998@free.fr: drop config option, rely on GOI package]
Signed-off-by: Yann E. MORIN <yann.morin.1998@free.fr>
(cherry picked from commit c45accd295)
Signed-off-by: Peter Korsgaard <peter@korsgaard.com>
Fixes the following security issues:
- CVE-2021-1386: Fix for UnRAR DLL load privilege escalation. Affects
0.103.1 and prior on Windows only.
- CVE-2021-1252: Fix for Excel XLM parser infinite loop. Affects 0.103.0
and 0.103.1 only.
- CVE-2021-1404: Fix for PDF parser buffer over-read; possible crash.
Affects 0.103.0 and 0.103.1 only.
- CVE-2021-1405: Fix for mail parser NULL-dereference crash. Affects
0.103.1 and prior.
- CVE-2021-27506: The ClamAV Engine (Version 0.103.1 and below) embedded in
Storsmshield Network Security (1.0 to 4.1.5) is subject to DoS in case of
parsing of malformed png files.
Signed-off-by: Peter Korsgaard <peter@korsgaard.com>
(cherry picked from commit 7aee27c2b9)
Signed-off-by: Peter Korsgaard <peter@korsgaard.com>
- Fix CVE-2021-21240: httplib2 is a comprehensive HTTP client library
for Python. In httplib2 before version 0.19.0, a malicious server
which responds with long series of "\xa0" characters in the
"www-authenticate" header may cause Denial of Service (CPU burn while
parsing header) of the httplib2 client accessing said server. This is
fixed in version 0.19.0 which contains a new implementation of auth
headers parsing using the pyparsing library.
- Fix CVE-2020-11078: In httplib2 before version 0.18.0, an attacker
controlling unescaped part of uri for `httplib2.Http.request()` could
change request headers and body, send additional hidden requests to
same server. This vulnerability impacts software that uses httplib2
with uri constructed by string concatenation, as opposed to proper
urllib building with escaping. This has been fixed in 0.18.0.
- Use LICENSE file instead of PKG-INFO
- pyparsing is a runtime dependency since version 0.19.0 and
bd9ee252c8https://github.com/httplib2/httplib2/blob/v0.19.1/CHANGELOG
Signed-off-by: Fabrice Fontaine <fontaine.fabrice@gmail.com>
Signed-off-by: Peter Korsgaard <peter@korsgaard.com>
(cherry picked from commit 2050b4869d)
Signed-off-by: Peter Korsgaard <peter@korsgaard.com>
Notice: This fixes a security issue, but in code not used in Buildroot:
ifcfg-rh: handle "802-1x.{,phase2-}ca-path". Otherwise setting this
property silently fails and a profile might accidentally not perform
any authentication (CVE-2020-10754).
Update indentation in hash file (two spaces)
https://gitlab.freedesktop.org/NetworkManager/NetworkManager/-/blob/1.22.16/NEWS
Signed-off-by: Fabrice Fontaine <fontaine.fabrice@gmail.com>
[Peter: Clarify that security issue isn't applicable to Buildroot]
Signed-off-by: Peter Korsgaard <peter@korsgaard.com>
(cherry picked from commit 6db751e1e1)
Signed-off-by: Peter Korsgaard <peter@korsgaard.com>
Fixes the following security issue:
- CVE-2021-20193: A flaw was found in the src/list.c of tar 1.33 and
earlier. This flaw allows an attacker who can submit a crafted input file
to tar to cause uncontrolled consumption of memory. The highest threat
from this vulnerability is to system availability
Signed-off-by: Peter Korsgaard <peter@korsgaard.com>
/home/test/mips-4.4/bin/mips-linux-gnu-ld: libdmalloc.a(arg_check.o): relocation R_MIPS_HI16 against `_dmalloc_flags' can not be used when making a shared object; recompile with -fPIC
libdmalloc.a(arg_check.o): could not read symbols: Bad value
Some files were not shown because too many files have changed in this diff
Show More
Reference in New Issue
Block a user
Blocking a user prevents them from interacting with repositories, such as opening or commenting on pull requests or issues. Learn more about blocking a user.