With this the test verifies not only that Apache can work in
principle, but also that it works with a read-only rootfs. Because of
the read-only rootfs the test itself cannot write to /root, so store
the test download in /tmp.
Signed-off-by: Fiona Klute <fiona.klute@gmx.de>
Signed-off-by: Thomas Petazzoni <thomas.petazzoni@bootlin.com>
(cherry picked from commit 0c349a8813)
Signed-off-by: Titouan Christophe <titouan.christophe@mind.be>
The previous configuration placed both logs and PID file in /var/logs,
which is not writable with a read-only rootfs (e.g. squashfs), as well
as non-standard. Starting HTTPD during boot failed with:
(30)Read-only file system: AH00091: httpd: could not open error log file /var/logs/error_log.
AH00015: Unable to open logs
An additional issue was that the Buildroot-default --prefix=/usr
override meant various Apache-internal directories (e.g. htdocs) were
placed directly in /usr. Note that the upstream default prefix is
/usr/local/apache2, not /usr/local.
Using the "Debian" layout provides a standard-compatible layout with
logs in /var/log/apache2 and PID file in /var/run/apache2 (both in
tmpfs with the default Buildroot fstab). Both directories need to
exist when the server starts, so handle that in the init script.
Signed-off-by: Fiona Klute <fiona.klute@gmx.de>
Signed-off-by: Thomas Petazzoni <thomas.petazzoni@bootlin.com>
(cherry picked from commit 1006666f67)
Signed-off-by: Titouan Christophe <titouan.christophe@mind.be>
https://www.openssh.org/releasenotes.html#10.5p1
Changes since OpenSSH 10.4
==========================
This release contains a number of security fixes and small bugfixes.
Security
========
* ssh-agent(1): fix an interaction between agent locking and the
session-bind@openssh.com extension that is used to identify
forwarded agents. These binding requests were refused when the
agent was locked, with the result that operations that were
intended to be limited to local use only could be performed
remotely, including the ability to add PKCS#11 tokens and make
use of keys that had destination restrictions applied.
Reported by sn0x-sharma
* ssh(1): avoid potential realloc use-after-free in the client if a
remote forwarding is added via the local session multiplexing
socket while a remote forwarding open request is pending with the
server. Report and fix from Brian Mingus of Cognatory
* sshd(8): make the authorized_keys "restrict" keyword apply
correctly to tunnel forwarding too (which is administratively
disabled by default). Reported by Erichen, Institute of Computing
Technology, Chinese Academy of Sciences
[...]
Signed-off-by: Bernd Kuhls <bernd@kuhls.net>
Signed-off-by: Julien Olivain <ju.o@free.fr>
(cherry picked from commit 054358ba9b)
Signed-off-by: Titouan Christophe <titouan.christophe@mind.be>
host-flex/host-bison are needed when building GCC from Git or from a
snapshot, not from release tarballs. The condition for the dependency
was actually incorrect: it was needed for the ARC-specific gcc
version (BR2_GCC_VERSION_ARC) but not for the ARC architecture in
general: building upstream GCC release tarballs for ARC does not
require host-flex/host-bison.
Cc: ARC Maintainers <arc-buildroot@synopsys.com>
Signed-off-by: Thomas Petazzoni <thomas.petazzoni@bootlin.com>
Signed-off-by: Julien Olivain <ju.o@free.fr>
(cherry picked from commit 4f867f1039)
Signed-off-by: Titouan Christophe <titouan.christophe@mind.be>
A new (and hopefully definitive) CPE is to be used for TF-A:
cpe:2.3:o:trustedfirmware:trusted_firmware-a:
as reported in TF-A directly[1]. NVD correctly reports[2] the new CPE
deprecates the "old" one Buildroot was using.
CVEs for projects under the TrustedFirmware umbrella are now seemingly
handled under the CPE vendor "trustedfirmware".
[1] efd7b189fa%5E%21/
[2] https://nvd.nist.gov/products/cpe/detail/2E1BD3E8-DF65-42E3-A0BA-747137D6DEF2
Signed-off-by: Quentin Schulz <quentin.schulz@cherry.de>
Signed-off-by: Julien Olivain <ju.o@free.fr>
(cherry picked from commit b7cf802ace)
Signed-off-by: Titouan Christophe <titouan.christophe@mind.be>
Changes:
Security and robustness release. Notable cramfsck changes:
* Reject dirent names containing "/", "." or ".." to close a path
traversal during `cramfsck -x` (reported in issue #12).
* Open regular files with O_CREAT|O_EXCL during extraction to
prevent duplicate-dirent attacks from truncating files reached
via a previously-extracted symlink.
* Fix outbuffer NUL termination and a 1-byte overflow in
do_symlink when running with both -v and -x.
* Harden romfs_read against truncated/malformed images by
zero-filling the window buffer and checking lseek/read returns.
* Reject directory entries that extend past their parent's size.
Documentation: README now documents cramfsck and lists all current
mkcramfs options; stale hard-link and endianness claims corrected;
NOTES trimmed of the 25-year-old Future Development section.
(See https://github.com/npitre/cramfs-tools/releases/tag/v2.2)
Signed-off-by: Thomas Petazzoni <thomas.petazzoni@bootlin.com>
Signed-off-by: Julien Olivain <ju.o@free.fr>
(cherry picked from commit 2c96a67d9b)
Signed-off-by: Titouan Christophe <titouan.christophe@mind.be>
wiki.gnome.org has a big deprecation warning saying "All information
on this site is out of date and should not be used." Point at the
project website instead.
Signed-off-by: Fiona Klute <fiona.klute@gmx.de>
Signed-off-by: Julien Olivain <ju.o@free.fr>
(cherry picked from commit 949063f92b)
Signed-off-by: Titouan Christophe <titouan.christophe@mind.be>
wiki.gnome.org has a big deprecation warning saying "All information
on this site is out of date and should not be used." Point at the
project website instead.
Signed-off-by: Fiona Klute <fiona.klute@gmx.de>
Signed-off-by: Julien Olivain <ju.o@free.fr>
(cherry picked from commit 9a7cd39c5d)
Signed-off-by: Titouan Christophe <titouan.christophe@mind.be>
wiki.gnome.org has a big deprecation warning saying "All information
on this site is out of date and should not be used." Point at the
project repository instead.
Signed-off-by: Fiona Klute <fiona.klute@gmx.de>
Signed-off-by: Julien Olivain <ju.o@free.fr>
(cherry picked from commit 47464cfbe1)
Signed-off-by: Titouan Christophe <titouan.christophe@mind.be>
wiki.gnome.org has a big deprecation warning saying "All information
on this site is out of date and should not be used." Point at the
project repository instead.
Signed-off-by: Fiona Klute <fiona.klute@gmx.de>
Signed-off-by: Julien Olivain <ju.o@free.fr>
(cherry picked from commit 16c5253138)
Signed-off-by: Titouan Christophe <titouan.christophe@mind.be>
wiki.gnome.org has a big deprecation warning saying "All information
on this site is out of date and should not be used." Point at the
project repository instead.
Signed-off-by: Fiona Klute <fiona.klute@gmx.de>
Signed-off-by: Julien Olivain <ju.o@free.fr>
(cherry picked from commit 19d11b5235)
Signed-off-by: Titouan Christophe <titouan.christophe@mind.be>
wiki.gnome.org has a big deprecation warning saying "All information
on this site is out of date and should not be used." Point at the
project repository instead.
Signed-off-by: Fiona Klute <fiona.klute@gmx.de>
Signed-off-by: Julien Olivain <ju.o@free.fr>
(cherry picked from commit 55cb1e8eea)
Signed-off-by: Titouan Christophe <titouan.christophe@mind.be>
wiki.gnome.org has a big deprecation warning saying "All information
on this site is out of date and should not be used." Point at the
project repository instead.
Signed-off-by: Fiona Klute <fiona.klute@gmx.de>
Signed-off-by: Julien Olivain <ju.o@free.fr>
(cherry picked from commit d7f835a4cb)
Signed-off-by: Titouan Christophe <titouan.christophe@mind.be>
wiki.gnome.org has a big deprecation warning saying "All information
on this site is out of date and should not be used." Point at the
project repository instead.
Signed-off-by: Fiona Klute <fiona.klute@gmx.de>
Signed-off-by: Julien Olivain <ju.o@free.fr>
(cherry picked from commit 3eda260ff4)
Signed-off-by: Titouan Christophe <titouan.christophe@mind.be>
wiki.gnome.org has a big deprecation warning saying "All information
on this site is out of date and should not be used." Point at the
project repository instead.
Signed-off-by: Fiona Klute <fiona.klute@gmx.de>
Signed-off-by: Julien Olivain <ju.o@free.fr>
(cherry picked from commit 15c4abfa52)
Signed-off-by: Titouan Christophe <titouan.christophe@mind.be>
wiki.gnome.org has a big deprecation warning saying "All information
on this site is out of date and should not be used." Point at the
project repository instead.
Signed-off-by: Fiona Klute <fiona.klute@gmx.de>
Signed-off-by: Julien Olivain <ju.o@free.fr>
(cherry picked from commit 8f0f84a400)
Signed-off-by: Titouan Christophe <titouan.christophe@mind.be>
The Github repository has been renamed from dracut-ng to dracut. The
wiki still exists, but the actual documentation has been moved to
dracut-ng.github.io.
Signed-off-by: Fiona Klute (Othermo GmbH) <fiona.klute@gmx.de>
Signed-off-by: Julien Olivain <ju.o@free.fr>
(cherry picked from commit ec8c6e4487)
Signed-off-by: Titouan Christophe <titouan.christophe@mind.be>
The patch `0008-awk.c-fix-CVE-2023-42366-bug-15874.patch` was introduced
in [1]. The IGNORE_CVES entry was removed while the patch is still
present in [2].
Re-introduce this IGNORE_CVES entry.
[1] 75c594d446 package/busybox: fix pending CVEs
[2] f88537c46b package/busybox: drop stale IGNORE_CVES entries
Signed-off-by: Thomas Perale <thomas.perale@mind.be>
[Julien: fix patch number in comment (s/0008/0007/)]
Signed-off-by: Julien Olivain <ju.o@free.fr>
(cherry picked from commit 092abbe035)
Signed-off-by: Titouan Christophe <titouan.christophe@mind.be>
When adding the libldns and python_scp, the corresponding tests were not
added to DEVELOPERS, preventing correct notifications in case of tests
failures.
Add the missing entries to enable proper author notifications in case of
failing tests.
Signed-off-by: Alexis Lothoré <alexis.lothore@bootlin.com>
Signed-off-by: Julien Olivain <ju.o@free.fr>
(cherry picked from commit 1209f3f7a1)
Signed-off-by: Titouan Christophe <titouan.christophe@mind.be>
Fixes following CVE's:
CVE-2026-70368: Fixed an out-of-bounds memory
access triggered by logging attacker-controlled protocol messages longer
than 1,024 bytes (thanks to AISLE Research and Clemens Lang).
CVE-2026-70367: Fixed a SOCKS server mode bypass of the localhost
destination filter using alternate local-address encodings and
interface-scoped IPv6 destinations (thanks to AISLE Research and Clemens
Lang).
Complete Changelog is here:
https://www.stunnel.org/NEWS.html
Signed-off-by: Waldemar Brodkorb <wbx@openadk.org>
Signed-off-by: Julien Olivain <ju.o@free.fr>
(cherry picked from commit 8b6eea299b)
Signed-off-by: Titouan Christophe <titouan.christophe@mind.be>
Upstream removed configure option INSTALL_EXAMPLE_CODE with commit
8434de3cbc
which was first released with version 2.11.0.
Upstream re-added a similar configure option named INSTALL_EXAMPLE_CODE
with commits
f8d989160e7c803c8538
which were first released with version 2.15.0.
Buildroot bumped the package to 2.15.0 with
8e713dcc88 and forgot to rename the
configure option.
Remove libva/x11/wayland-related configure option due to upstream commit
8434de3cbc
which was first released with version 2.11.0. Remove the selection of
optional packages for these dependencies as well.
Removed unneeded libatomic handling.
Signed-off-by: Bernd Kuhls <bernd@kuhls.net>
Signed-off-by: Julien Olivain <ju.o@free.fr>
(cherry picked from commit 53c29cf046)
Signed-off-by: Titouan Christophe <titouan.christophe@mind.be>
- Update BOTAN_VERSION to 3.11.1
- Remove 0001-Add-more-value-barriers-to-avoid-compiler-induced-side-channels.patch
as it is already integrated upstream in this version.
Fixed in 3.11.1:
- CVE-2026-34580: Resolve certificate verification bypass bug introduced
in 3.11.0 (GH #5500)
- CVE-2026-34582: Resolve TLS 1.3 client authentication bypass (GH #5599)
Fixed in 3.11.0:
- CVE-2026-32877: Fix a heap over-read during SM2 decryption (GH #5450)
- CVE-2026-32883: Fix an OCSP response forgery vulnerability (GH #5449)
- CVE-2026-32884: Fix a name constraints bypass for DNS names (GH #5448)
- Remove the --disable-altivec configuration option as it has been removed
from the Botan build system in version 3.x
- Optimize the --disable-neon logic using the yx pattern.
In Botan 3.x, the --disable-neon flag is specifically targeted at the
arm32 architecture. Furthermore, Buildroot's BR2_ARM_CPU_HAS_NEON
variable is only defined for 32-bit ARM, which previously caused a
false-positive --disable-neon flag to be passed on AArch64 builds
- Update license.txt hash in botan.hash due to the copyright year update
to 2026
https://botan.randombit.net/news.html#version-3-11-1-2026-03-31
Signed-off-by: Shubham Chakraborty <chakrabortyshubham66@gmail.com>
[Julien: fix CVE numbers in commit log]
Signed-off-by: Julien Olivain <ju.o@free.fr>
(cherry picked from commit 402c94c2d7)
Signed-off-by: Titouan Christophe <titouan.christophe@mind.be>
- botan dropped the usage of Boost.Filesystem in 2.10.0 [0]
- botan never actively searched for Boost.System, as it is header-only
the dependecy can be dropped too
The only part of boost botan currently uses is asio. So use --with-boost option
when boost is selected.
[0] aff8cc8a7a
Signed-off-by: Michael Nosthoff <buildroot@heine.tech>
Signed-off-by: Julien Olivain <ju.o@free.fr>
(cherry picked from commit 8ff577bb35)
Signed-off-by: Titouan Christophe <titouan.christophe@mind.be>
Changes made in this release:
Ben Wolsieffer (1):
nptl: fix getting main stack size on no-MMU
Max Filippov (4):
stdio: fix %a formatting of inf and nan
stdio: fix radix point output for %a
stdio: output sign with NaNs
stdio: restrict first digit of %a output to 0 or 1
Ramin Moussavi (19):
libintl.h: route stubs through format_arg inlines; fix gettext_noop
build: scope .NOTPARALLEL to locale targets only, restore parallel build
limits.h: define PAGE_SIZE/PAGESIZE like musl, fixing the gdb build
wait4: fall back to waitid(2) at runtime when wait4 returns ENOSYS
pagesize: restore PAGE_SHIFT fallback for binfmt_flat (no auxv)
buildsys: build locale headers in-tree, not via a recursive sub-make
extra/locale: skip locales the build host cannot provide
csky: fix struct semid_ds layout for TIME64
csky: make __kernel_uid_t/__kernel_gid_t 32-bit
hppa: fix inotify/signalfd/timerfd flag values
hppa: do not set IPC_64 for the SysV IPC *ctl commands
x86: fix struct semid_ds layout for TIME64
i386: add CFI to __libc_i386_syscall6 for cancellation unwinding
i386: do not set IPC_64 for the SysV IPC *ctl commands on 5.1+ kernels
buildsys: terminate .eh_frame in shared objects
m68k: make the __jmp_buf layout match what setjmp.S actually saves
inet: use the direct accept4 syscall when __NR_accept is missing
m68k: implement atomic operations with the CAS instruction
libc: fix struct shmid_ds layout for TIME64
Waldemar Brodkorb (10):
netinet/in.h: sync with glibc
bits/fcntl-linux.h: sync with glibc
add copy_file_range syscall wrapper
sys/fanotify.h: drop include to fix c-sky compilation
adjtimex: fix for architectures lacking __NR_clock_adjtime, f.e. frv
sys/user.h: restore required macros
netinet/tcp.h: sync with glibc
loongarch: add basic static only support
riscv: setcontext: fix linking error
bump version for 1.0.59 release
ramin (16):
ldso: harden _dl_tls_get_addr_soft against an unusable DTV
microblaze: implement atomic operations with lwx/swx
ldso: microblaze: add missing addend to R_MICROBLAZE_TLSDTPREL32
ldso: make the _dl_tls_get_addr_soft DTV check microblaze-specific
microblaze: fix struct semid_ds layout for TIME64
m68k: fix struct semid_ds layout for TIME64
mips: fix fallocate() 64-bit argument passing on n32
mips: fix mmap64() for large offsets on n32
mips: fix setjmp() on n32/n64 (.cpreturn, not .cprestore)
mips: always set IPC_64 for the SysV IPC *ctl commands
libc: fix struct msqid_ds layout for TIME64 on all common-header arches
linuxthreads: fix SIGSEGV in MIPS cancellable wrappers (waitpid, nanosleep)
ldso: serialize dl_iterate_phdr to fix concurrent unwind hang on SMP
nptl: cancel the current thread directly instead of via SIGCANCEL
mips: only n32/n64 always need IPC_64, not o32
m68k: use the kernel cmpxchg helper for atomics on ColdFire
Patch 0001 is applied upstream and is removed here.
Fixes:
- https://autobuild.buildroot.net/results/2bd/2bd73b0060cad4f44649ffe4ea60c4775160d86e
Signed-off-by: Waldemar Brodkorb <wbx@openadk.org>
Signed-off-by: Julien Olivain <ju.o@free.fr>
(cherry picked from commit b94d3eb728)
Signed-off-by: Titouan Christophe <titouan.christophe@mind.be>
New release with following changes:
Adam Lackorzynski (1):
termios.h: Add IBSHIFT
Charles Mirabile (11):
riscv: add defconfigs
riscv: add support for static pie binaries
riscv: add support for ucontext functions
pipe: directly invoke pipe2 from kernel when !UCLIBC_LINUX_SPECIFIC
Fix {g,s}ettimeofday when !UCLIBC_HAS_REALTIME
Fix build with static-pie but without nptl threads
do not remove bits/uClibc_ctype.h when !UCLIBC_HAS_CTYPE_TABLES
getopt-susv3: remove call to gettext `_` macro
readdir{,_r}: remove loop to skip files with d_ino == 0
spawn: allow file actions on no-mmu targets
getopt-susv3: add support for reseting the scan by setting optind to zero
Marcus Haehnel (1):
aarch64/fpu_control.h: Don't use gcc-internal types
Jan Klötzke (1):
elf/dl-support.c: remove unnecessary memset
Ramin Moussavi (9):
libsanitizer: arm/ucontext: fix VFP save/restore to use uc_regspace area
libsanitizer: arm/ucontext.h: add glibc-style REG_R0..REG_R15 aliases
libsanitizer: link.h/dl-iterate-phdr: expose dl_phdr_info TLS fields
libsanitizer: ldso: track _dl_load_adds/_dl_load_subs counters
libsanitizer: ldso: implement _dl_tls_get_addr_soft for dl_phdr_info::dlpi_tls_data
libsanitizer: drop __pagesize, make _dl_pagesize the single source of truth
libsanitizer: sys/user.h: remove obsolete BFD trad-core NBPG/UPAGES defines
libsanitizer: features.h: hard-wire _FILE_OFFSET_BITS=64 to match library's 64-bit off_t/ino_t
libsanitizer: fts.h: drop the bogus _FILE_OFFSET_BITS==64 #error
Waldemar Brodkorb (7):
bits/statx.h: add some missing defines
bits/statx.h: sync struct with glibc
sys/fanotify.h: sync with musl
libiconv: fix typedef of iconv_t
misc: add unicode character functions (c11)
netinet/tcp.h: sync with glibc
bump version for 1.0.58 release
Signed-off-by: Waldemar Brodkorb <wbx@openadk.org>
Signed-off-by: Julien Olivain <ju.o@free.fr>
(cherry picked from commit c7fef3704c)
Signed-off-by: Titouan Christophe <titouan.christophe@mind.be>
It has been good practice for a while to describe the kind of change
in the commit message of any patch that changes license file
hashes. This is important so any substantial changes don't go
unnoticed. However it wasn't explicitly stated in the manual, fix
that.
Signed-off-by: Fiona Klute <fiona.klute@gmx.de>
Signed-off-by: Julien Olivain <ju.o@free.fr>
(cherry picked from commit ef655b53dd)
Signed-off-by: Titouan Christophe <titouan.christophe@mind.be>
Localedef is built from the glibc source code, so license information
is the same.
Signed-off-by: Fiona Klute (Othermo GmbH) <fiona.klute@gmx.de>
Signed-off-by: Julien Olivain <ju.o@free.fr>
(cherry picked from commit 187d329d1d)
Signed-off-by: Titouan Christophe <titouan.christophe@mind.be>
The COPYINGv3 license file was added with upstream commit
e067e53080386e93dcf8b07e25fb6656f2c8941e, it applies to scripts used
during build.
LGPL-3.0+ applies to sysdeps/htl/raise.c, which is used for the Hurd
platform. Buildroot builds only Linux, so the file should not be
compiled, but it is part of the downloaded (and possibly shared, if
"make legal-info" is used) archive. The same applies to the manual.
Checked against the copyright file of the Debian "libc6" package (as
of 2.42-17 and 2.43-2), note that Debian excludes the manual.
Signed-off-by: Fiona Klute (Othermo GmbH) <fiona.klute@gmx.de>
Signed-off-by: Julien Olivain <ju.o@free.fr>
(cherry picked from commit 45b24c43a0)
Signed-off-by: Titouan Christophe <titouan.christophe@mind.be>
This fixes the following vulnerability:
- CVE-2026-6368
(alternative to commit a4d4c7527a)
Signed-off-by: Titouan Christophe <titouan.christophe@mind.be>
This configuration for the s6lx9 microboard was added back in March 2012
(commit 49084a1982), and has not been
updated in any significant way since then.
This defconfig still use a 4.4.7 (no longer maintained) and out of tree
devicetree (lx9_mmu.dts).
Remove its support.
Fixes:
https://gitlab.com/buildroot.org/buildroot/-/jobs/14728914045 (s6lx9_microboard_defconfig)
Signed-off-by: Romain Naour <romain.naour@smile.fr>
Signed-off-by: Julien Olivain <ju.o@free.fr>
(cherry picked from commit 81490b9592)
Signed-off-by: Titouan Christophe <titouan.christophe@mind.be>
wiki.gnome.org has a big deprecation warning saying "All information
on this site is out of date and should not be used." Point at the
librsvg project on gitlab.gnome.org instead.
Signed-off-by: Fiona Klute <fiona.klute@gmx.de>
Signed-off-by: Julien Olivain <ju.o@free.fr>
(cherry picked from commit c01426fe96)
Signed-off-by: Titouan Christophe <titouan.christophe@mind.be>
A start script has been missing since the package was added, so the
daemon was not started automatically on sysv/busybox systems.
This also fixes a regression in systemd builds introduced in fccdc6bd,
when the package switched from local unit file to upstream.
Signed-off-by: Joachim Wiberg <troglobit@gmail.com>
Signed-off-by: Julien Olivain <ju.o@free.fr>
(cherry picked from commit 54485e075d)
Signed-off-by: Titouan Christophe <titouan.christophe@mind.be>
libgtk4 passes -Dintrospection=disabled unconditionally, so Gtk-4.0.gir is
never installed. webkitgtk depends on gobject-introspection and generates
WebKit-6.0.gir, which includes Gtk-4.0.gir, so building both fails:
FAILED: WebKit-6.0.gir
Couldn't find include 'Gtk-4.0.gir' (search path:
'['.../usr/share/gir-1.0', ...]')
Tie the option to BR2_PACKAGE_GOBJECT_INTROSPECTION and add the dependency,
the way package/libgtk3 already does. Systems without introspection keep the
previous behaviour.
Signed-off-by: Alsey Coleman Miller <alseycmiller@gmail.com>
Signed-off-by: Fiona Klute <fiona.klute@gmx.de>
(cherry picked from commit 8c5f774172)
Signed-off-by: Titouan Christophe <titouan.christophe@mind.be>
Whether the host libglib2 picks up sysprof support depends on whether
libsysprof-capture happens to be installed on the build machine, which
makes the host build depend on the host environment. Disable sysprof
explicitly for the host build so the result is deterministic.
Keep sysprof enabled for the target build: it is useful to profile and
measure the performance of applications running on the target.
Signed-off-by: Jean-Michel Hautbois <jeanmichel.hautbois@yoseli.org>
[Fiona: also apply to package/libglib2/libglib2-bootstrap]
Signed-off-by: Fiona Klute <fiona.klute@gmx.de>
(cherry picked from commit c92dc611e5)
Signed-off-by: Titouan Christophe <titouan.christophe@mind.be>
Since NetworkManager 1.54, packaged since commit 24827ae398
(package/network-manager: bump to 1.56.0), new services related to
running in an initrd are now installed, which prevents proper startup,
with systemd reporting that two units declare the same BusName.
When systemd is configured without initrd support, drop the
NetworkManager initrd-related services.
Fixes: 24827ae398
Signed-off-by: Yann E. MORIN <yann.morin@orange.com>
Cc: Fiona Klute <fiona.klute@gmx.de>
Cc: Marcus Hoffmann <buildroot@bubu1.eu>
Acked-by: TIAN Yuanhao <tianyuanhao3@163.com>
Signed-off-by: Fiona Klute <fiona.klute@gmx.de>
(cherry picked from commit 32bdc4710a)
Signed-off-by: Titouan Christophe <titouan.christophe@mind.be>
Running TestUsbIp may fail when checking if two QEMU USB Keyboards are
reported by lsusb. On fast host, the second QEMU USB keyboard may not
aleady detected when lsusb is executed. So wait a bit, to let the new
keyboard be detected.
Signed-off-by: Romain Naour <romain.naour@smile.fr>
Signed-off-by: Julien Olivain <ju.o@free.fr>
(cherry picked from commit 933a591d8a)
Signed-off-by: Titouan Christophe <titouan.christophe@mind.be>
Duplicate of lua-argparse.
Note: the argparse package was introduced in Buildroot commit [1].
lua-argparse was introduced in [2]. For consistency with other Lua
packages which has the "lua-" prefix, this commit removes the package
without the prefix.
[1] 169d1632d5
[2] e70abe9716
Signed-off-by: Francois Perrad <francois.perrad@gadz.org>
Signed-off-by: Julien Olivain <ju.o@free.fr>
(cherry picked from commit 59f9c25d70)
Signed-off-by: Titouan Christophe <titouan.christophe@mind.be>
Buildroot commit aedf131da6 bumped the
package to 8.5.0 which made opcache a mandatory dependency but kept the
CFLAGS added in 2015 with buildroot commit
e054764917.
As it turns out we need to remove the CFLAGS to fix the build with the
bootlin-aarch64-glibc-old defconfig as detected by the Gitlab pipelines:
ext/opcache/shared_alloc_posix.o: In function `create_segments':
shared_alloc_posix.c:(.text+0xcc): undefined reference to `shm_open'
shared_alloc_posix.c:(.text+0x11c): undefined reference to `shm_unlink'
shared_alloc_posix.c:(.text+0x19c): undefined reference to `shm_unlink'
shared_alloc_posix.c:(.text+0x1b8): undefined reference to `shm_unlink'
as they seem to disturb the detection of librt.
It is unclear which upstream commits added since 2015 fixed the original
problem so a backport to LTS branches is not advised.
Signed-off-by: Bernd Kuhls <bernd@kuhls.net>
Signed-off-by: Julien Olivain <ju.o@free.fr>
(cherry picked from commit 623ed7c8c7)
Signed-off-by: Titouan Christophe <titouan.christophe@mind.be>
Upstream bumped the minimum required gcc version from 6.1 to 8.1 in
commit 84ec3ddf9fd3 ("bump minimum gcc version to 8.1"), so the build
now fails with "Compiler too old; need at least gcc 8.1" on older
toolchains.
There is no gcc 8.0.x release (the 8.x series starts at 8.1.0), so
BR2_TOOLCHAIN_GCC_AT_LEAST_8 is enough to express this dependency.
While at it, add the gcc version to the openblas-arch comment, which
only checked for C++ support and would therefore stay hidden on
toolchains that are too old.
Fixes: 597d5d10ec ("package/armadillo: bump to version 15.0.1")
Signed-off-by: Dario Binacchi <dario.binacchi@amarulasolutions.com>
Signed-off-by: Julien Olivain <ju.o@free.fr>
(cherry picked from commit cec50f48d6)
Signed-off-by: Titouan Christophe <titouan.christophe@mind.be>
BR2_ARCH_IS_64 is set for mips64/mips64el even when the n32 ABI is
used, so openblas was built with BINARY=64. Its build system then
passes -mabi=64, which conflicts with the n32 sysroot:
gnu/stubs.h:35:11: fatal error: gnu/stubs-n64_hard.h: No such file
or directory
For openblas, BINARY refers to the pointer size rather than to the
architecture, and n32 uses 32-bit pointers, so BINARY=32 is correct
there.
Signed-off-by: Dario Binacchi <dario.binacchi@amarulasolutions.com>
Signed-off-by: Julien Olivain <ju.o@free.fr>
(cherry picked from commit fd685fc8c2)
Signed-off-by: Titouan Christophe <titouan.christophe@mind.be>
Changelog since 1.0.7
- 1.0.9: This is a bugfix release, fixing minor vulnerabilities
and expanding the test suite.
- 1.0.8: This is a bugfix release, fixing minor security
vulnerabilities and expanding the test suite.
Signed-off-by: Michele Comignano <mcdev@playlinux.net>
Signed-off-by: Julien Olivain <ju.o@free.fr>
(cherry picked from commit cd8161a374)
Signed-off-by: Titouan Christophe <titouan.christophe@mind.be>
Add upstream patch to fix the following build issue:
In file included from [...]/sysroot/usr/include/sys/types.h:26,
from atopsar.c:36:
[...]/sysroot/usr/include/features.h:167:22: error: operator '<' has no left operand
167 | # if _POSIX_C_SOURCE < 200809L
| ^
Tested with:
$ ./utils/test-pkg -p atop -n 1
bootlin-armv5-uclibc [1/1]: OK
Signed-off-by: Titouan Christophe <titouan.christophe@mind.be>
Since Buildroot commit [1] "package/gcc: switch to GCC 15.x as the
default", compiling freescale_imx91frdm_defconfig fails in TF-A with
error:
include/drivers/nxp/trdc/imx_trdc.h:7: error: header guard 'IMX_TRDC_H' followed by '#define' of a different macro [-Werror=header-guard]
7 | #ifndef IMX_TRDC_H
include/drivers/nxp/trdc/imx_trdc.h:8: note: 'IMX_XRDC_H' is defined here; did you mean 'IMX_TRDC_H'?
8 | #define IMX_XRDC_H
The issue happen because this defconfig is using a Buildroot
(internal) toolchain which uses gcc version 15 by default.
This issue was fixed upstream in [2], first included in TF-A v2.13.
This commit updates U-Boot, TF-A and Linux to use the NXP
tag lf-6.18.20-2.0.0, which include this fixes.
Note that, as described in the commit log of [3] which was used as a
base for this defconfig, U-Boot and Linux were forks. Now the
necessary patches are included in the vendor BSP, this commit
switches those repos to use the vendor ones.
This commit also removes the linux-headers.hash custom hash file
which was never needed, because the defconfig used an external
toolchain.
Also, due to the upstream uboot commit [4], this commit adds a uboot
config fragment to disable CONFIG_EFI_CAPSULE_AUTHENTICATE, to
remove the dependency on the command "cert-to-efi-sig-list", provided
the host efitools package, which is not yet in Buildroot.
This commit was run tested on board 700-94610 Rev A1.
[1] a75b8623f5
[2] 2e9198d0e0%5E%21/
[3] 2e05f22ff8
[4] fd58c275f6
Signed-off-by: Julien Olivain <ju.o@free.fr>
(cherry picked from commit 25c65e0428)
Signed-off-by: Titouan Christophe <titouan.christophe@mind.be>
Since Buildroot commit [1] "package/gcc: switch to GCC 15.x as the
default", compiling freescale_imx93frdm_defconfig fails in TF-A with
error:
include/drivers/nxp/trdc/imx_trdc.h:7: error: header guard 'IMX_TRDC_H' followed by '#define' of a different macro [-Werror=header-guard]
7 | #ifndef IMX_TRDC_H
include/drivers/nxp/trdc/imx_trdc.h:8: note: 'IMX_XRDC_H' is defined here; did you mean 'IMX_TRDC_H'?
8 | #define IMX_XRDC_H
The issue happen because this defconfig is using a Buildroot
(internal) toolchain which uses gcc version 15 by default.
This issue was fixed upstream in [2], first included in TF-A v2.13.
This commit updates U-Boot, TF-A and Linux to use the NXP
tag lf-6.18.20-2.0.0, which include this fixes.
Note that, as described in the commit log of [3] which introduced
this defconfig, U-Boot and Linux were forks. Now the necessary
patches are included in the vendor BSP, this commit switches those
repos to use the vendor ones.
While at it, this commit also switches the defconfig to use an
external glibc stable Bootlin toolchain, to follow recommendations
from [4]. Since an external toolchain is used, the linux-headers.hash
custom hash file is no longer needed and is also removed. At the
time of this commit, the Bootlin stable toolchain is a gcc 14.
Also, due to the upstream uboot commit [5], this commit adds a uboot
config fragment to disable CONFIG_EFI_CAPSULE_AUTHENTICATE, to
remove the dependency on the command "cert-to-efi-sig-list", provided
the host efitools package, which is not yet in Buildroot.
This commit was run tested on board 700-94611 Rev B1.
[1] a75b8623f5
[2] 2e9198d0e0%5E%21/
[3] 2e05f22ff8
[4] https://elinux.org/Buildroot:DeveloperDaysELCE2024#Rules_for_defconfigs
[5] fd58c275f6
Reported-by: Robert P. J. Day <rpjday@crashcourse.ca>
Tested-by: Robert P. J. Day <rpjday@crashcourse.ca>
Signed-off-by: Julien Olivain <ju.o@free.fr>
(cherry picked from commit fcc6df2e10)
Signed-off-by: Titouan Christophe <titouan.christophe@mind.be>
Commit [1] "package/uboot-tools: fix host FIT signature support"
slightly changed the logic in which the file
$(@D)/include/generated/autoconf.h is created.
When there is no Kconfig sub-option selected, the file is no longer
created and the build fails with error:
include/linux/kconfig.h:4:10: fatal error: generated/autoconf.h: No such file or directory
The issue can be reproduced with the with the simple commands:
cat >.config <<EOF
BR2_aarch64=y
BR2_TOOLCHAIN_EXTERNAL=y
BR2_PACKAGE_HOST_UBOOT_TOOLS=y
EOF
make olddefconfig
make host-uboot-tools
This commit fixes the issue by simply adding a touch of the file
at the beginning to make sure it will always exist.
[1] 928cc5dc5c
Cc: James Hilliard <james.hilliard1@gmail.com>
Reported-by: Robert P. J. Day <rpjday@crashcourse.ca>
Tested-by: Robert P. J. Day <rpjday@crashcourse.ca>
Signed-off-by: Julien Olivain <ju.o@free.fr>
(cherry picked from commit 9f17ac02b8)
Signed-off-by: Titouan Christophe <titouan.christophe@mind.be>
U-Boot host tools use the tools configuration namespace when code calls
CONFIG_IS_ENABLED(). With USE_HOSTCC, CONFIG_IS_ENABLED(FIT_SIGNATURE)
resolves to CONFIG_TOOLS_FIT_SIGNATURE, while
CONFIG_VAL(FIT_SIGNATURE_MAX_SIZE) resolves to
CONFIG_TOOLS_FIT_SIGNATURE_MAX_SIZE.
The host-uboot-tools package only generates the old CONFIG_FIT_SIGNATURE
define. This makes tools/Makefile include fit_check_sign, but the host code
sees FIT signature support as disabled and the OpenSSL-backed signing and
verification objects are omitted. As a result, mkimage accepts a signature
node without writing its value or injecting a required public key.
fit_check_sign then has no required key and reports success without
checking the configuration signature.
A FIT-support-only configuration never exercises this path, which is why
the existing hash-only runtime test still passes.
Generate the tools FIT signature options needed by the host code and pass
CONFIG_TOOLS_LIBCRYPTO=y so the OpenSSL-backed signing, verification and
cipher objects are selected. Keep CONFIG_FIT_SIGNATURE=y in the make
options because U-Boot tools/Makefile still uses it to build
fit_check_sign.
Extend TestHostUbootTools to create an RSA-signed FIT, require a 256-byte
configuration signature and a required public key, verify the FIT, corrupt
the signature, and require verification to fail.
Signed-off-by: James Hilliard <james.hilliard1@gmail.com>
[Julien: add comments in runtime test]
Signed-off-by: Julien Olivain <ju.o@free.fr>
(cherry picked from commit 928cc5dc5c)
Signed-off-by: Titouan Christophe <titouan.christophe@mind.be>
https://www.samba.org/samba/history/samba-4.24.5.html
This is a security release in order to address the following defects:
o CVE-2026-6949:
TSIG packet with name compression can crash DNS
Incorrect size calculations when a TSIG record contains
compressed names can lead to a large out-of-bounds write
causing the server to crash.
https://www.samba.org/samba/security/CVE-2026-6949.html
o CVE-2026-58216:
An authenticated user could possibly crash a KDC process
A kpasswd packet that contains malformed ASN.1 might cause
the server to access 6 bytes of unallocated memory. This
memory is not exposed to the user, but in some
circumstances the server could crash.
https://www.samba.org/samba/security/CVE-2026-58216.html
o CVE-2026-58218:
DNS signing DoS via TKEY name cache exhaustion
An unauthenticated user can repeatedly register names TKEY
names, which floods a cache causing legitimate TKEYs to be
expunged. This can practically block the use DNS TSIG
signing.
https://www.samba.org/samba/security/CVE-2026-58218.html
o CVE-2026-58221:
Samba AD authenticated LDAP access domain takeover
Samba AD low-privilege authenticated LDAP access allows
modifications to internal LDB special DNs, which permits a
domain takeover.
https://www.samba.org/samba/security/CVE-2026-58221.html
o CVE-2026-58222:
Samba AD LDAP Compare filter injection and trusted-request
confusion disclose protected attributes
An ordinary authenticated domain user can bypass access
checks and query confidential Active Directory attributes
(such as KDS root keys) via LDAP Compare requests. Due to a
filter injection flaw and trusted execution context, the
LDAP Compare operation can be turned into a
protected-attribute disclosure oracle.
https://www.samba.org/samba/security/CVE-2026-58222.html
o CVE-2026-58224:
The CTDB protocol has bounds checking issues
CTDB fails to do integrity checking of received packets.
This includes failure to check field lengths against packet
lengths when unmarshalling packets.
https://www.samba.org/samba/security/CVE-2026-58224.html
Signed-off-by: Bernd Kuhls <bernd@kuhls.net>
Signed-off-by: Julien Olivain <ju.o@free.fr>
(cherry picked from commit b5e6133eab)
Signed-off-by: Titouan Christophe <titouan.christophe@mind.be>
The --with-systemd option controls only if systemd units are
installed, so there is no build time dependency. Disable systemd
unconditionally for the host package because Buildroot cannot and
should not install systemd units on the host.
Fixes host-p11-kit install error:
install: reguläre Datei '/usr/lib/systemd/user/p11-kit-server.socket' kann nicht angelegt werden: Keine Berechtigung
install: reguläre Datei '/usr/lib/systemd/user/p11-kit-server.service' kann nicht angelegt werden: Keine Berechtigung
Signed-off-by: Fiona Klute (Othermo GmbH) <fiona.klute@gmx.de>
Signed-off-by: Peter Korsgaard <peter@korsgaard.com>
(cherry picked from commit a0cadb4552)
Signed-off-by: Titouan Christophe <titouan.christophe@mind.be>
Changelog since 1.0.6:
This is a bugfix release, fixing modest security vulnerabilities
discovered by A. Ramos.
Signed-off-by: Yegor Yefremov <yegorslists@googlemail.com>
Signed-off-by: Peter Korsgaard <peter@korsgaard.com>
(cherry picked from commit 81f7c82740)
Signed-off-by: Titouan Christophe <titouan.christophe@mind.be>
Changelog since 1.0.5:
Fix various minor issues, like theoretical
integer overflows for extreme inputs or NULL
dereferences if the application passes NULL
where it should not.
Signed-off-by: Yegor Yefremov <yegorslists@googlemail.com>
Signed-off-by: Julien Olivain <ju.o@free.fr>
(cherry picked from commit 6d8a1bb4c8)
Signed-off-by: Titouan Christophe <titouan.christophe@mind.be>
https://github.com/strukturag/libheif/releases/tag/v1.23.1
Fixes the following CVEs:
CVE-2026-62289 (GHSA-jc8f-p23p-5hjg)
Integer underflow in Fraction constructor via double clap transform
application
CVE-2026-62291 (GHSA-xpw3-9rhw-482x)
Heap out of bounds write in libheif uncompressed encoder when writing
images with mismatched auxiliary alpha dimensions
CVE-2026-62292 (GHSA-73p7-m7gg-w2jv)
Out-of-bounds read in uncompressed unci tile range slicing
CVE-2026-62377 (GHSA-9ww4-9v47-m7pj)
Reachable assertion in HeifContext::get_track() aborts on a valid-but-
empty HEIF sequence file
(GHSA-46rp-pcq2-rpmr)
Heap out-of-bounds write in the uncompressed encoder for RRGGBB images
with interleaved bit-depth ≤ 8
Signed-off-by: Bernd Kuhls <bernd@kuhls.net>
Signed-off-by: Julien Olivain <ju.o@free.fr>
(cherry picked from commit bcb48623fa)
Signed-off-by: Thomas Perale <thomas.perale@mind.be>
https://downloads.isc.org/isc/bind9/9.20.26/doc/arm/html/notes.html#notes-for-bind-9-20-26https://downloads.isc.org/isc/bind9/9.20.26/doc/arm/html/changelog.htmlhttps://seclists.org/oss-sec/2026/q3/208
Fixes
CVE-2026-10723: Incorrect acceptance of NSEC3 records
CVE-2026-10822: Key Record using PRIVATEDNS algorithm may lead to unexpected exit
CVE-2026-11331: Potential wildcard CNAME RPZ policy bypass
CVE-2026-11605: Unnecessary validation of DNSSEC signed records
CVE-2026-11622: Potential memory usage beyond configured limits
CVE-2026-11721: Cache poisoning possible with label count discrepancy, RRSIG, and wildcards
CVE-2026-12617: Record ordering based unexpected exit with CNAME or DNAME
CVE-2026-13204: Unexpected exit in certain situations with NSEC and NSEC3 both present
CVE-2026-13321: DNSSEC Validation Bypass via Out-of-Zone NSEC Next Field
Signed-off-by: Bernd Kuhls <bernd@kuhls.net>
[Julien: update pgp key id in hash file comment]
Signed-off-by: Julien Olivain <ju.o@free.fr>
(cherry picked from commit 8c96a8981f)
Signed-off-by: Thomas Perale <thomas.perale@mind.be>
A few headers outside libiberty use LGPL-2.1+, too, and other headers
and some scripts use GPL-2.0+.
Signed-off-by: Fiona Klute (Othermo GmbH) <fiona.klute@gmx.de>
Signed-off-by: Julien Olivain <ju.o@free.fr>
(cherry picked from commit 95b77f7a71)
Signed-off-by: Thomas Perale <thomas.perale@mind.be>
BSD-0-Clause is not a recognized SPDX license identifier. 0BSD is used
in the source SPDX-License-Identifier headers, and the associated text
[1] matches the COPYING.0BSD file.
FSFUL and FSFULLR are the "few permissive licenses" of certain build
system files mentioned in COPYING.
Move "Public Domain" to the end of the list because it applies only to
a few files.
[1] https://spdx.org/licenses/0BSD.html
Signed-off-by: Fiona Klute (Othermo GmbH) <fiona.klute@gmx.de>
Signed-off-by: Julien Olivain <ju.o@free.fr>
(cherry picked from commit 15e2433e1f)
Signed-off-by: Thomas Perale <thomas.perale@mind.be>
The package is part of Buildroot and thus under GPL-2.0-or-later
unless stated otherwise, as described in COPYING.
Signed-off-by: Fiona Klute (Othermo GmbH) <fiona.klute@gmx.de>
Signed-off-by: Julien Olivain <ju.o@free.fr>
(cherry picked from commit 0f80126bfe)
Signed-off-by: Thomas Perale <thomas.perale@mind.be>
The package is part of Buildroot and thus under GPL-2.0-or-later
unless stated otherwise, as described in COPYING.
Signed-off-by: Fiona Klute (Othermo GmbH) <fiona.klute@gmx.de>
Signed-off-by: Julien Olivain <ju.o@free.fr>
(cherry picked from commit c19a7fad93)
Signed-off-by: Thomas Perale <thomas.perale@mind.be>
The package is part of Buildroot and thus under GPL-2.0-or-later
unless stated otherwise, as described in COPYING.
Signed-off-by: Fiona Klute (Othermo GmbH) <fiona.klute@gmx.de>
Signed-off-by: Julien Olivain <ju.o@free.fr>
(cherry picked from commit 9b8a2d8633)
Signed-off-by: Thomas Perale <thomas.perale@mind.be>
The package is part of Buildroot and thus under GPL-2.0-or-later
unless stated otherwise, as described in COPYING.
Signed-off-by: Fiona Klute (Othermo GmbH) <fiona.klute@gmx.de>
Signed-off-by: Julien Olivain <ju.o@free.fr>
(cherry picked from commit 770b684426)
Signed-off-by: Thomas Perale <thomas.perale@mind.be>
All these packages are part of Buildroot and thus under
GPL-2.0-or-later unless stated otherwise, as described in COPYING.
package/skeleton-custom is excluded because it provides a way to copy
skeleton data from any location chosen by the user, the license of
which is unknown to Buildroot.
Signed-off-by: Fiona Klute (Othermo GmbH) <fiona.klute@gmx.de>
Signed-off-by: Julien Olivain <ju.o@free.fr>
(cherry picked from commit 927c575964)
Signed-off-by: Thomas Perale <thomas.perale@mind.be>
https://matt.ucc.asn.au/dropbear/CHANGES
- Security: Fix a use-after-free in X11 forwarding that could possibly lead
to memory corruption. This is vulnerable to authenticated users if X11
forwarding is enabled. By default X11 forwarding is not built.
In 2026.89 the server is running as the authenticated user for X11
forwarding, in earlier versions it runs as root.
This removes X11 "single connection" which has probably never been used.
Reported by @peter-pe
882f83806d
Added patch to fix build errors which would be introduced by this bump:
86baa66fc9
Signed-off-by: Bernd Kuhls <bernd@kuhls.net>
Signed-off-by: Julien Olivain <ju.o@free.fr>
(cherry picked from commit 0c8bd5739c)
Signed-off-by: Thomas Perale <thomas.perale@mind.be>
https://gitlab.com/libssh/libssh-mirror/-/tags/libssh-0.11.5https://www.libssh.org/2026/07/21/libssh-0-12-1-and-0-11-5-security-release
s/
Fixes the following security problems:
CVE-2026-15370: Stack buffer overflow in SFTP server longname construction
CVE-2026-59843: Denial of service via zero advertised channel packet size
CVE-2026-59844: Denial of service via oversized SFTP read length
CVE-2026-59845: Denial of service via unchecked ProxyCommand fork() failure
CVE-2026-59846: Information disclosure via ProxyCommand %r username expansion
CVE-2026-59847: Integrity downgrade via OpenSSL AES-GCM tag verification
CVE-2026-59848: Denial of service via SFTP responses with unknown request IDs
CVE-2026-59849: Denial of service via automatic certificate authentication loop
CVE-2026-59850: Use-after-free via data callbacks on closed channels
Zero-initialize every ssh_string
Signed-off-by: Bernd Kuhls <bernd@kuhls.net>
Signed-off-by: Julien Olivain <ju.o@free.fr>
(cherry picked from commit 93e7a673e8)
Signed-off-by: Thomas Perale <thomas.perale@mind.be>
"bzip2-1.0.4" is not a valid SPDX license identifier. The license text
in archival/libarchive/bz/LICENSE in the busybox source matches the
text associated with the bzip2-1.0.6 identifier [1].
[1] https://spdx.org/licenses/bzip2-1.0.6.html
Signed-off-by: Fiona Klute (Othermo GmbH) <fiona.klute@gmx.de>
Signed-off-by: Julien Olivain <ju.o@free.fr>
(cherry picked from commit f9687af626)
Signed-off-by: Thomas Perale <thomas.perale@mind.be>
The Nettle manual (nettle.html in the source archive) states:
> Nettle is dual licenced under the GNU General Public License version
> 2 or later, and the GNU Lesser General Public License version 3 or
> later. When using Nettle, you must comply fully with all conditions
> of at least one of these licenses. [...]
This means "or" is the correct description. Ellipsis covers a note
that a few files are licensed more permissively.
Signed-off-by: Fiona Klute (Othermo GmbH) <fiona.klute@gmx.de>
Signed-off-by: Julien Olivain <ju.o@free.fr>
(cherry picked from commit 9a77d5547a)
Signed-off-by: Thomas Perale <thomas.perale@mind.be>
All these bundled subprojects explicitly give "Apache-2.0 OR
LGPL-2.1-or-later" in their README.md files.
Signed-off-by: Fiona Klute (Othermo GmbH) <fiona.klute@gmx.de>
Signed-off-by: Julien Olivain <ju.o@free.fr>
(cherry picked from commit 0c2b14a8b5)
Signed-off-by: Thomas Perale <thomas.perale@mind.be>
The patch 0002-Makefile.am-fix-build-without-makeinfo.patch is not longer
needed since it builds even if 'makeinfo' is not installed, so it's removed.
For release annoucne, see:
https://lists.gnu.org/archive/html/info-gnu/2025-12/msg00002.html
Changelog:
Changes are detailed in the git repo logs:
$ git clone git://git.sv.gnu.org/guile.git
$ git whatchanged
Signed-off-by: Pedro Aguilar <paguilar@paguilar.org>
[Julien:
- remove .checkpackageignore entry to fix check-package error
- add link to release announce
]
Signed-off-by: Julien Olivain <ju.o@free.fr>
(cherry picked from commit 643f480f43)
Signed-off-by: Thomas Perale <thomas.perale@mind.be>
When building pahole using a modern GCC (e.g. when building
host-pahole), discarded-qualifiers and unused-but-set-variable warnings
are produced. In builds that don't set CMAKE_BUILD_TYPE=Release, -Werror
gets set and causes a build failure.
Fix this by backporting an unreleased upstream patch (for
discarded-qualifiers) and adding another pending one for
unused-but-set-variable (and, arguably, a correctness issue).
Fixes: https://autobuild.buildroot.org/results/ba7/ba79fb9d08b2c6ec573b79fdbb6b4880bf603a57
Signed-off-by: Florian Larysch <fl@n621.de>
Signed-off-by: Julien Olivain <ju.o@free.fr>
(cherry picked from commit 8419f0f0c7)
[Thomas: backport to v1.28]
Signed-off-by: Thomas Perale <thomas.perale@mind.be>
Buildroot commit fabcd7c8cc bumped the
package from 28.0 to 30.0 which includes upstream commit
a01cb6e63f
that was first included in version 29.0 and added among others
-fstack-protector-all to cxx_flags guarded with a new configure option
ENABLE_HARDENING which default to ON.
This commit causes build errors with toolchains with SSP support:
[ 44%] Linking CXX executable ../bin/bitcoin
/home/autobuild/autobuild/instance-40/output-1/host/lib/gcc/i686-buildroot-linux-musl/15.2.0/../../../../i686-buildroot-linux-musl/bin/ld:
CMakeFiles/bitcoin.dir/bitcoin.cpp.o:
in function `fs::PathToString(fs::path const&)':
bitcoin.cpp:(.text+0x4c):
undefined reference to `__stack_chk_fail_local'
Upstream later removed the forementioned configure option with commit
00ba3ba303
that was first included in version 30.0 so we need to remove
-fstack-protector-all from CMakeLists.txt.
Fixes:
https://autobuild.buildroot.net/results/093/093253c79fed1c5b93decc3124e9ef4622168efe/
Signed-off-by: Bernd Kuhls <bernd@kuhls.net>
Signed-off-by: Julien Olivain <ju.o@free.fr>
(cherry picked from commit ed51b4b691)
Signed-off-by: Thomas Perale <thomas.perale@mind.be>
Boot an armv5 image running the mdnsd responder alongside the mquery
client, then check that service discovery works: mquery browses for the
bundled _http._tcp service and mdnsd, on the same host, answers over the
loopback of the eth0 multicast group.
Signed-off-by: Joachim Wiberg <troglobit@gmail.com>
[Julien: add "mdnsd -v" invocation to show version]
Signed-off-by: Julien Olivain <ju.o@free.fr>
(cherry picked from commit 4cd5559163)
[Thomas: remove last test that requires v1.1]
Signed-off-by: Thomas Perale <thomas.perale@mind.be>
https://github.com/tuxera/ntfs-3g/wiki/NTFS-3G-Release-Historyhttps://seclists.org/oss-sec/2026/q3/152
Multiple vulnerabilities have been discovered in ntfs-3g.
A new version 2026.7.7 is now available at https://github.com/tuxera/ntfs-3g
(ntfscat) Fix heap memory corruption when processing a corrupt or maliciously crafted filesystem. (CVE-2026-42616)
Fix heap memory corruption when copying index data from root to an index block in a corrupt or maliciously crafted filesystem. (CVE-2026-42617)
Fix single-byte heap buffer overflow when decompressing maliciously crafted compressed file data. (CVE-2026-42618)
Fix heap buffer overflow when copying the tail data of an index block to a freshly allocated block. (CVE-2026-46569)
Fix out-of-bounds read when processing symlink reparse data in a corrupt or maliciously crafted filesystem. (CVE-2026-46571)
Fix heap memory corruption for maliciously crafted or corrupt index data descending to an out-of-bounds tree depth. (CVE-2026-46570)
Fix heap buffer overflow for maliciously crafted or corrupt index data during a node split. (CVE-2026-46572)
Fix heap buffer overflow when building inherited ACL data. (CVE-2026-56135)
Fix out of bounds access when clearing an index root in maliciously crafted or corrupt index data. (CVE-2026-56136)
Switched to sha256 tarball hash provided by upstream.
Signed-off-by: Bernd Kuhls <bernd@kuhls.net>
Signed-off-by: Julien Olivain <ju.o@free.fr>
(cherry picked from commit 26811cb110)
Signed-off-by: Thomas Perale <thomas.perale@mind.be>
During its configure step, libgpg-error needs awk:
configure -> src/gen-lock-obj.sh -> objdump + awk on test binary
This call is used on the output from objdump on a test binary to
retrieve the size of some data structure, and generate accordingly an
internal header (lock-obj-pub.native.h). However, libgpg-error buildroot
package does not depend explicitely on host-gawk: if host-gawk is not
part of the build, or if it is built later than libgpg-error,
libgpg-error autotool tooling will eventually pick the build machine
awk. On top of this issue, despite the configure.ac suggesting that it
supports different implementations of awk, libgpg-error configure step
will not parse correctly the output from objdump when using mawk,
leading to a wrong lock-obj-pub.native.h header being generated:
With gawk:
typedef struct
{
long _vers;
union {
volatile char _priv[24];
long _x_align;
long *_xp_align;
} u;
} gpgrt_lock_t;
#define GPGRT_LOCK_INITIALIZER {1,{{0,0,0,0,0,0,0,0, \
0,0,0,0,0,0,0,0, \
0,0,0,0,0,0,0,0}}}
With mawk:
typedef struct
{
long _vers;
union {
volatile char _priv[0];
long _x_align;
long *_xp_align;
} u;
} gpgrt_lock_t;
#define GPGRT_LOCK_INITIALIZER {1,{{}}}
This issue has been observed for example on Debian 13 with mawk
installed: it fails to parse mtx_size, leading to a size 0, and so
generating crashes at runtime because of the invalid size embedded in
libgpg-error.
Side note: the lock-obj-pub.native.h header file is correctly
generated, when using mawk 1.3.4 20200120 from Debian 12.
The described issue happen with mawk 1.3.4 20250131 from Debian 13.
libgpg-error should be fixed upstream to properly handle this data
structure size guessing even when using mawk, but anyway the
corresponding buildroot package should not randomly use the build
machine host tooling or buildroot-provided host tooling depending on
whether host-gawk has been selected and built before it.
Enforce an explicit dependency on host-gawk for libgpg-error to make
sure that it systematically uses the buildroot-provided awk.
Co-developped-by: Bernard Gautier <bernard.gautier@nav-timing.safrangroup.com>
Signed-off-by: Bernard Gautier <bernard.gautier@nav-timing.safrangroup.com>
Co-developped-by: Alexis Lothoré <alexis.lothore@bootlin.com>
Signed-off-by: Alexis Lothoré <alexis.lothore@bootlin.com>
[Julien: add the side note that mawk from debian 12 works]
Signed-off-by: Julien Olivain <ju.o@free.fr>
(cherry picked from commit 21bf78411e)
Signed-off-by: Thomas Perale <thomas.perale@mind.be>
Buildroot commit 2774502344 bumped the
package from 4.2.2 to 6.2.3. Upstream added the usage of
std::scoped_lock in version 6.2.0:
a760b3278a
causing a build error detected by the Gitlab pipelines for the
bootlin-aarch64-glibc-old defconfig:
../src/inc/upnpapi.h:132:22: error:
‘scoped_lock’ is not a member of ‘std’
scoped_lock was introduced in gcc 7.1:
https://gcc.gnu.org/onlinedocs/libstdc++/manual/status.html#status.iso.2017
so we raise the minimum required gcc version accordingly.
Signed-off-by: Bernd Kuhls <bernd@kuhls.net>
Signed-off-by: Julien Olivain <ju.o@free.fr>
(cherry picked from commit 5f543cfcda)
Signed-off-by: Thomas Perale <thomas.perale@mind.be>
Fixes the following security issues:
CVE-2026-39822: os: root escape via symlink plus trailing slash
go1.26.5 (released 2026-07-07) includes security fixes to the
crypto/tls and os packages, as well as bug fixes to the compiler,
the runtime, the go command, and the net, os, and syscall packages.
https://go.dev/doc/devel/release#go1.26.5
Signed-off-by: Christian Stewart <christian@aperture.us>
Signed-off-by: Julien Olivain <ju.o@free.fr>
(cherry picked from commit 6e12744652)
Signed-off-by: Thomas Perale <thomas.perale@mind.be>
libcamera has moved for a while now to gitlab.freedesktop.org. The
mirror on git.linuxtv.org is still active, but it isn't the canonical
repository and has less bandwidth than freedesktop.org. Switch the
libcamera source URL to gitlab.freedesktop.org.
Signed-off-by: Laurent Pinchart <laurent.pinchart@ideasonboard.com>
Reviewed-by: Kieran Bingham <kieran.bingham@ideasonboard.com>
[Julien: removed trailing slash in _SITE]
Signed-off-by: Julien Olivain <ju.o@free.fr>
(cherry picked from commit 138713f39a)
Signed-off-by: Thomas Perale <thomas.perale@mind.be>
https://matt.ucc.asn.au/dropbear/CHANGES
- Security: server: Don't allow -B (accept blank password) with
-t (two factor auth). If run with -t and -B a user configured with a
blank password would be allowed to log in without pubkey auth.
23ec782856
Reported by nvidia
- Security: server: Fix parsing of long authorized_keys lines.
The remainder of a long line would be handled as the start of a new line.
In the case where external programs add semi-trusted public keys to
authorized_keys, a crafted key might bypass restrictions such as "command=".
8d8e1930b8
Reported by nvidia
Signed-off-by: Bernd Kuhls <bernd@kuhls.net>
Signed-off-by: Julien Olivain <ju.o@free.fr>
(cherry picked from commit ce9ed75bbc)
Signed-off-by: Thomas Perale <thomas.perale@mind.be>
The Debian 12 Bookworm snapshot we use, 20250203, uses the new deb822
format [0] for source list files; it carries a source list file that
points to the current repository, not to the snapshot.
Even though we do inject an old-style source list that points to the
snapshot repository, the packages in the current repository are more
recent than the one in the snapshot, so when we install our packages,
they get retrieved mostly from the current repository rather than from
the snapshot. The image is not reproducible.
Switch to using the new deb822-style source list file.
Note: we do not need to carry the "Latest just before" trick: the
snapshot repository will use the most recent actual snapshot before the
requested dated, so we can just use the date of the image we use (stuck
at midnight because we don't have better).
Since the snapshot repository can be really slow, while at the same time
the remote http server not dropping connections, it can take a very long
while to build the image; add a timeout so that stale connections are
detected and re-attemped early-ish (the timeout applies to both the
connect and the actual download, so it should be large enough to
accomodate slowish network connections).
Fixes: c95d5b8e1e (support/docker: move to current bookworm (Debian
12) snapshot)
[0] https://manpages.debian.org/trixie/apt/sources.list.5.en.html#DEB822-STYLE_FORMAT
Signed-off-by: Yann E. MORIN <yann.morin@orange.com>
Cc: Peter Korsgaard <peter@korsgaard.com>
Cc: Romain Naour <romain.naour@smile.fr>
Signed-off-by: Romain Naour <romain.naour@smile.fr>
(cherry picked from commit 3460675872)
Signed-off-by: Thomas Perale <thomas.perale@mind.be>
https://www.openssh.org/releasenotes.html#10.4p1
Changes since OpenSSH 10.3
==========================
This release contains a number of security fixes as well as general
bugfixes and a couple of new features.
Security
========
* sftp(1): when downloading files on the command-line using
"sftp host:/path .", a malicious server could cause the file to
be downloaded to an unexpected location. This issue was identified
by the Swival Security Scanner.
* scp(1): when copying files between two remote destinations, do
not allow a malicious server to write files to the parent
directory of the intended target directory. This issue was
identified by the Swival Security Scanner.
* sshd(8): when using the "internal-sftp" SFTP server implementation
(this is not the default), long command lines were previously
truncated silently after the 9th argument. If a security-relevant
option was in the 10th or later position, it would be discarded.
Reported by Steve Caffrey.
* sshd(8): add a documentation note to mention that the
GSSAPIStrictAcceptorCheck option is ineffective when the server
is joined to a Windows Active Directory. Reported by Yarin Aharoni
of Safebreach.
* sshd(8): DisableForwarding=yes didn't override PermitTunnel=yes
as it was documented to do. Note that PermitTunnel is not enabled
by default. Reported independently by Huzaifa Sidhpurwala of
Redhat and Marko Jevtic.
* sshd(8): avoid a potential pre-authentication denial of service
when GSSAPIAuthentication was enabled (this feature is off by
default). This was not mitigated by MaxAuthTries, but would be
penalised by PerSourcePenalties. This was reported by Manfred
Kaiser of the milCERT AT (Austrian Ministry of Defence).
* sshd(8): fix a number of cases where the minimum authentication
delay was not being enforced. Reported by the Orange Cyberdefense
Vulnerability Team.
* ssh(1): fix a possible client-side use-after-free if the server
changes its host key during a key reexchange. This was reported by
Zhenpeng (Leo) Lin of Depthfirst.
[...]
Signed-off-by: Bernd Kuhls <bernd@kuhls.net>
Signed-off-by: Julien Olivain <ju.o@free.fr>
(cherry picked from commit 90add0c09e)
Signed-off-by: Thomas Perale <thomas.perale@mind.be>
Release notes:
https://webkitgtk.org/2026/06/02/webkitgtk2.52.4-released.html
Fixes the following security issues:
https://webkitgtk.org/security/WSA-2026-0003.html
Includes fixes (among others) for CVE-2026-28847, CVE-2026-28883,
CVE-2026-28901, CVE-2026-28902, CVE-2026-28903, CVE-2026-28904,
CVE-2026-28905, CVE-2026-28907, CVE-2026-28942, CVE-2026-28946,
CVE-2026-28947, CVE-2026-28953, CVE-2026-28955, CVE-2026-28958,
CVE-2026-43658, and CVE-2026-43660.
Also added 0001-REGRESSION-313606-main-Fails-to-build-with-system-ma.patch,
to get webkitgtk compiled when -DUSE_SYSTEM_MALLOC=ON is in use.
Signed-off-by: Thomas Devoogdt <thomas.devoogdt@barco.com>
[Julien: add "security" in commit log title]
Signed-off-by: Julien Olivain <ju.o@free.fr>
(cherry picked from commit 013612b496)
Signed-off-by: Thomas Perale <thomas.perale@mind.be>
This fixes the following vulnerability:
- CVE-2025-64503:
cups-filters contains backends, filters, and other software required
to get the cups printing service working on operating systems other
than macos. In cups-filters prior to 1.28.18, by crafting a PDF file
with a large `MediaBox` value, an attacker can cause CUPS-Filter 1.x’s
`pdftoraster` tool to write beyond the bounds of an array. First, a
PDF with a large `MediaBox` width value causes `header.cupsWidth` to
become large. Next, the calculation of `bytesPerLine =
(header.cupsBitsPerPixel * header.cupsWidth + 7) / 8` overflows,
resulting in a small value. Then, `lineBuf` is allocated with the
small `bytesPerLine` size. Finally, `convertLineChunked` calls
`writePixel8`, which attempts to write to `lineBuf` outside of its
buffer size (out of bounds write). In libcupsfilters, the maintainers
found the same `bytesPerLine` multiplication without overflow check,
but the provided test case does not cause an overflow there, because
the values are different. Commit
50d94ca0f2fa6177613c97c59791bde568631865 contains a patch, which is
incorporated into cups-filters version 1.28.18.
For more information, see:
- https://www.cve.org/CVERecord?id=CVE-2025-64503
- 50d94ca0f2
Signed-off-by: Thomas Perale <thomas.perale@mind.be>
Signed-off-by: Julien Olivain <ju.o@free.fr>
(cherry picked from commit def2405f39)
Signed-off-by: Thomas Perale <thomas.perale@mind.be>
This fixes the following vulnerability:
- CVE-2026-34933:
Avahi is a system which facilitates service discovery on a local
network via the mDNS/DNS-SD protocol suite. Prior to version 0.9-rc4,
any unprivileged local user can crash avahi-daemon by sending a single
D-Bus method call with conflicting publish flags. This issue has been
patched in version 0.9-rc4.
For more information, see:
- https://www.cve.org/CVERecord?id=CVE-2026-34933
- 0be89b6bb5
Signed-off-by: Thomas Perale <thomas.perale@mind.be>
Signed-off-by: Julien Olivain <ju.o@free.fr>
(cherry picked from commit 88f3b8366b)
Signed-off-by: Thomas Perale <thomas.perale@mind.be>
https://blog.clamav.net/2026/07/clamav-153-and-145-security-patch.html
Fixes CVE-2026-20213, CVE-2026-20214, CVE-2026-20215, CVE-2026-20216,
CVE-2026-20217, CVE-2026-20243 & CVE-2026-20244.
"Upgraded the Rust tar dependency to resolve the RUSTSEC-2026-0067 and
RUSTSEC-2026-0068 advisories, and upgraded the Rust openssl dependency
to resolve CVE-2026-41676."
Signed-off-by: Bernd Kuhls <bernd@kuhls.net>
Signed-off-by: Julien Olivain <ju.o@free.fr>
(cherry picked from commit 31cd41c84b)
Signed-off-by: Thomas Perale <thomas.perale@mind.be>
Removed patch which is included in this bump.
Fixes CVE-2026-5435, CVE-2026-6238 & CVE-2026-6791.
git shortlog 4070d808bea1c077eb7e7d52b52b91cae98205d5..
Adhemerval Zanella (3):
math: Fix fma alignment when exponent difference is exactly 64 (BZ 34183)
arm: Save/restore VFP registers in PLT trampolines (BZ 34144, BZ 15792)
posix: Fix stack overflow in wordexp tilde expansion (BZ 34091, CVE-2026-6791)
Florian Weimer (8):
iconv: Suppress intermediate errors with //TRANSLIT (bug 34236)
resolv: Declare __p_class_syms, __p_type_syms for internal use
resolv: Fix ns_sprintrrf formatting of class, type values (bug 34289)
resolv: Improve formatting of unknown records in ns_sprintrrf
resolv: Check for inet_ntop failure in ns_sprintrrf
resolv: More types as unknown in ns_sprintrrf (CVE-2026-5435)
resolv: Fix buffer overreads in ns_sprintrrf (CVE-2026-6238)
resolv: Add test case tst-ns_sprintrr (bug 34033, bug 34069)
Jakub Jelinek (1):
Rename __unused fields to __glibc_reserved.
John David Anglin (1):
hppa: Fix missing call to __feraiseexcept (BZ 34306)
Pino Toscano (1):
Hurd: comment PF_LINK/AF_LINK defines
Sam James (1):
elf: don't clobber ld.so.conf in tst-glibc-hwcaps-prepend-cache [BZ #34210]
Samuel Thibault (3):
Hurd: comment PF_ROUTE/AF_ROUTE defines
Hurd: comment ioctls which cannot currently compile
Hurd: restore some SIOC ioctls
Signed-off-by: Bernd Kuhls <bernd@kuhls.net>
Signed-off-by: Julien Olivain <ju.o@free.fr>
(cherry picked from commit 42d63edf4c)
Signed-off-by: Thomas Perale <thomas.perale@mind.be>
The 'mlkem.h' header is no longer present in wolfssl v5.9.2 [1] and the
content was merged in the 'wc_mlkem.h' header.
[1] 7a2cf5b655
Signed-off-by: Thomas Perale <thomas.perale@mind.be>
Signed-off-by: Julien Olivain <ju.o@free.fr>
(cherry picked from commit 275faf6d61)
Signed-off-by: Thomas Perale <thomas.perale@mind.be>
Changes with nginx 1.30.3
*) Security: a heap memory buffer overflow might occur in a worker
process when using a configuration with "ignore_invalid_headers off;"
and "large_client_header_buffers" with large configured values when
proxying a specially crafted request to HTTP/2 or gRPC backend,
allowing an attacker to cause worker process memory corruption or
segmentation fault in a worker process (CVE-2026-42055).
Thanks to Mufeed VH of Winfunc Research.
*) Security: a heap memory buffer overread might occur in a worker
process while handling a specially sent response with decoding from
UTF-8 via the "charset_map" directive, allowing an attacker to cause
a limited disclosure of worker process memory or segmentation fault
in a worker process (CVE-2026-48142).
Thanks to Han Yan of Xiaomi and p4p3r of CYBERONE.
Signed-off-by: Waldemar Brodkorb <wbx@openadk.org>
Signed-off-by: Peter Korsgaard <peter@korsgaard.com>
(cherry picked from commit 9b8c65a6c1)
Signed-off-by: Thomas Perale <thomas.perale@mind.be>
See here for a complete Changelog:
https://downloads.asterisk.org/pub/telephony/asterisk/ChangeLog-22-current.html
Security Fixes:
GHSA-3g56-cgrh-95p5: chan_unistim DIALPAGE digit handling can overflow phone_number and crash Asterisk
GHSA-3rhj-hhw7-m6fw: NULL Pointer Dereference in HTTP AMI Digest Authentication
GHSA-4pgv-j3mr-3rcp: Reflected XSS in Phone Provisioning HTTP Error Pages
GHSA-589g-qgf8-m6mx: Stack buffer overflow in MWI NOTIFY Message-Account parsing
GHSA-746q-794h-cc7f: Out-of-Bounds Read in Q.931 Information Element Parser (H.323 Addon)
GHSA-8jhw-m2hg-vp3h: Heap Buffer Overflow in OGG/Speex File Playback (format_ogg_speex)
GHSA-8jw3-ccr9-xrmf: Buffer over-read in Asterisk PJSIP MWI body parser
GHSA-g8q2-p36q-94f6: Heap-use-after-free in Asterisk PJSIP TCP/SDP handling when TCP connection closes during SDP processing
GHSA-h5hv-jmgj-92q2: CVE-2022-37325 fix is absent from current chan_ooh323 Q.931 party-number parser
GHSA-j2mm-57pq-jh94: Possible RED T.140 Generation Accumulation OOB Write
GHSA-mxgm-8c6f-5p8f: Stack buffer overflow in res_xmpp XMPP namespace prefix handling
GHSA-ph27-3m5q-mj5m: SQL Injection in cel_pgsql and cel_tds via CELGenUserEvent eventtype Field
GHSA-q9fr-m7g8-6ph5: Asterisk app_sms.c copies externally controlled SMS lengths into fixed in-struct buffers
GHSA-qf8j-jp7h-c5hx: Out-of-Bounds Write in Codec2 Decoder Due to Floor/Ceil Sample Count Mismatch
GHSA-r6c2-hwc2-j4mp: LDAP Filter Injection in res_config_ldap via SIP Username (Unauthenticated Information Disclosure)
GHSA-vfhr-r9x9-c687: Possible RED T.140 Heap Buffer Overflow
GHSA-vrfp-mg3q-3959: ARI setChannelVar bypasses live_dangerously and permits FILE() writes
GHSA-wcvv-g26m-wx5c: ARI REST-over-WebSocket read-only bypass allows arbitrary module path load and conditional RCE
GHSA-x348-j6c9-77f3: Stack Buffer Overflow in H.323 ooTrace() via Unbounded vsprintf into Fixed 2048-byte Buffer
GHSA-xgj6-2gc5-5x9c: ast_loggrabber executes python script in world writable directory(/tmp) leading to potential privilege escalation And RCE
Signed-off-by: Waldemar Brodkorb <wbx@openadk.org>
Signed-off-by: Peter Korsgaard <peter@korsgaard.com>
(cherry picked from commit 7f48325de6)
Signed-off-by: Thomas Perale <thomas.perale@mind.be>
For more information on the release, see:
- https://mariadb.com/docs/release-notes/community-server/10.11/10.11.18
It fixes the following vulnerabilities:
- CVE-2026-48163:
MariaDB server is a community developed fork of MySQL server. From
versions 10.6.1 to before 10.6.27, 10.11.1 to before 10.11.18, 11.4.1
to before 11.4.12, 11.8.1 to before 11.8.8, and 12.3.1, during the SST
the donor node is interpolating parameters that the joiner sent into
the command line. Not all parameters were properly validated which
could allow a malicious joiner to execute arbitrary shell commands on
the donor side via the rsync SST method. This issue has been patched
in versions 10.6.27, 10.11.18, 11.4.12, 11.8.8, and 12.3.2.
For more information, see:
https://www.cve.org/CVERecord?id=CVE-2026-48163
- CVE-2026-48165:
MariaDB server is a community developed fork of MySQL server. From
versions 10.6.1 to before 10.6.27, 10.11.1 to before 10.11.18, 11.4.1
to before 11.4.12, 11.8.1 to before 11.8.8, and 12.3.1, a high-
privileged MariaDB user could've used wsrep_sst_receive_address or
wsrep_sst_donor global system variables to execute shell commands as
the uid of the mariadbd process on the galera joiner node. This issue
has been patched in versions 10.6.27, 10.11.18, 11.4.12, 11.8.8, and
12.3.2.
For more information, see:
https://www.cve.org/CVERecord?id=CVE-2026-48165
- CVE-2026-49261:
MariaDB server is a community developed fork of MySQL server. Versions
10.6.1 through 10.6.26, 10.11.1 through 10.11.17, 11.4.1 through
11.4.11, 11.8.1 through 11.8.7, and 12.3.1 with `wsrep_notify_cmd`
enabled would execute shell commands embedded in the name of the
joiner node. This is fixed in 10.6.27, 10.11.18, 11.4.12, 11.8.8, and
12.3.2. As a workaround, anyone who cannot upgrade now should disable
`wsrep_notify_cmd`.
For more information, see:
https://www.cve.org/CVERecord?id=CVE-2026-49261
Signed-off-by: Thomas Perale <thomas.perale@mind.be>
Signed-off-by: Fiona Klute <fiona.klute@gmx.de>
(cherry picked from commit c69f28ae5c)
Signed-off-by: Thomas Perale <thomas.perale@mind.be>
In the precedent patch "support/testing: test_gnupg2.py: use
assertRunNotOk()" [1] a small typo (OK instead of Ok) was introduced
in the test_gnupg2.py file, which caused a runtime failure.
This patch simply replace "self.assertRunNotOK(cmd)" with
"self.assertRunNotOk(cmd)" to correct this typo.
[1] cb791850ad
Signed-off-by: Dowan Gullient <dowan.gullient@smile.fr>
[Fiona: fix commit message formatting]
Signed-off-by: Fiona Klute <fiona.klute@gmx.de>
(cherry picked from commit cfd7483a26)
Signed-off-by: Thomas Perale <thomas.perale@mind.be>
- CVE-2026-55200:
libssh2 through 1.11.1, fixed in commit 97acf3df contains an out-of-
bounds write vulnerability in ssh2_transport_read() that fails to
enforce upper bounds on packet_length field. Remote attackers can send
crafted SSH packets with excessively large packet_length values to
corrupt heap memory and achieve remote code execution.
For more information, see:
- https://www.cve.org/CVERecord?id=CVE-2026-55200
- 97acf3dfda
Signed-off-by: Thomas Perale <thomas.perale@mind.be>
Signed-off-by: Fiona Klute <fiona.klute@gmx.de>
(cherry picked from commit c5aa932745)
Signed-off-by: Thomas Perale <thomas.perale@mind.be>
Fixes the following vulnerability:
- CVE-2026-55199:
libssh2 through 1.11.1, fixed in commit 1762685, contains a pre-
authentication denial of service vulnerability in the SSH_MSG_EXT_INFO
handler in src/packet.c that allows a malicious SSH server to cause a
client CPU exhaustion loop by sending a crafted extension count value.
A malicious server can set nr_extensions to 0xFFFFFFFF during key
exchange, causing the client to spin in a tight CPU loop for over 60
seconds because return values from _libssh2_get_string() are unchecked
and the session timeout does not apply to CPU-bound loops.
For more information, see:
- https://www.cve.org/CVERecord?id=CVE-2026-55199
- 17626857d2
Signed-off-by: Thomas Perale <thomas.perale@mind.be>
Signed-off-by: Fiona Klute <fiona.klute@gmx.de>
(cherry picked from commit 3c8cfad804)
Signed-off-by: Thomas Perale <thomas.perale@mind.be>
- CVE-2026-6192:
A vulnerability was identified in uclouvain openjpeg up to 2.5.4. This
impacts the function opj_pi_initialise_encode in the library
src/lib/openjp2/pi.c. The manipulation leads to integer overflow. The
attack must be carried out locally. The exploit is publicly available
and might be used. The identifier of the patch is
839936aa33eb8899bbbd80fda02796bb65068951. It is suggested to install a
patch to address this issue.
For more information, see:
- https://www.cve.org/CVERecord?id=CVE-2026-6192
- 839936aa33
Signed-off-by: Thomas Perale <thomas.perale@mind.be>
Signed-off-by: Fiona Klute <fiona.klute@gmx.de>
(cherry picked from commit 353007cf40)
Signed-off-by: Thomas Perale <thomas.perale@mind.be>
The sample script would've passed even if the connections list was
empty. Check that there is at least one connection, and that the
sample script can read loopback device information.
Signed-off-by: Fiona Klute <fiona.klute@gmx.de>
Signed-off-by: Romain Naour <romain.naour@smile.fr>
(cherry picked from commit f38f5bb593)
Signed-off-by: Thomas Perale <thomas.perale@mind.be>
In 11aa1cfa5a the patch was accidentally
moved into a versioned directory with the wrong version (2.82.0
instead of 2.82.4) and thus not applied. However, there have been no
issues reported.
The patch description mentions being needed to fix build errors in
package/atk and package/libnice. It was originally added in
b094f88a4d, and amended for libnice in
2c916b400b. package/atk was removed in
2c3ca7bea1, because atk has been merged
into at-spi2-core. Both at-spi2-core and libnice are Meson packages,
as was atk at the time of its removal.
Both current packages build with the following configuration (tested
using utils/test-pkg):
BR2_PACKAGE_PYTHON3=y
BR2_PACKAGE_GOBJECT_INTROSPECTION=y
BR2_PACKAGE_LIBNICE=y
BR2_PACKAGE_AT_SPI2_CORE=y
Evidently the patch is no longer needed, presumably because the
correct search path for GIR files is set by other means, and we can
remove it instead of fixing the version number of the patch directory.
Signed-off-by: Fiona Klute <fiona.klute@gmx.de>
Tested-by: Thomas Perale <thomas.perale@mind.be>
Signed-off-by: Peter Korsgaard <peter@korsgaard.com>
(cherry picked from commit c9fabfcb9f)
Signed-off-by: Thomas Perale <thomas.perale@mind.be>
Libglib2-bootstrap is only used as dependency to build
gobject-introspection and then libglib2 with GOI support. It should
not be installed to target, even if in practice libglib2 should
overwrite anything it has installed.
Signed-off-by: Fiona Klute <fiona.klute@gmx.de>
Signed-off-by: Peter Korsgaard <peter@korsgaard.com>
(cherry picked from commit 866462e8dd)
Signed-off-by: Thomas Perale <thomas.perale@mind.be>
Buildroot commit f89ca996b6 fixed the
build of linux-pam with musl in 2020 but did not remove the restric-
tions in place for login/runuser/su which were added earlier with
these commits:
login (2015): 25ecd24579
runuser (2017): 09860f354a
su (2017): c6488923fb
Signed-off-by: Bernd Kuhls <bernd@kuhls.net>
Signed-off-by: Fiona Klute <fiona.klute@gmx.de>
(cherry picked from commit 91d356ee7e)
Signed-off-by: Thomas Perale <thomas.perale@mind.be>
TestIptables expect netfilter legacy tables enabled in the kernel.
Make sure we use iptables-legacy:
iptables --version
iptables v1.8.11 (legacy)
The test would fail if nftables compat (iptables-nft) is enabled.
iptables --version
iptables v1.8.11 (nf_tables)
Add the following configuration fragment to enable iptables-nft:
BR2_PACKAGE_IPTABLES_NFTABLES=y
BR2_PACKAGE_IPTABLES_NFTABLES_DEFAULT=y
Acked-by: Fiona Klute <fiona.klute@gmx.de>
Tested-by: Fiona Klute <fiona.klute@gmx.de>
Signed-off-by: Romain Naour <romain.naour@smile.fr>
Signed-off-by: Fiona Klute <fiona.klute@gmx.de>
(cherry picked from commit 1b2f65bbe9)
Signed-off-by: Thomas Perale <thomas.perale@mind.be>
Since kernels 6.17, support for netfilter legacy tables were disabled
by default [1] but iptables package needs Netfilter legacy tables
support enabled in the kernel when nftables compat is not enabled.
Make sure to enable CONFIG_IP_NF_IPTABLES_LEGACY and
CONFIG_NETFILTER_XTABLES_LEGACY for kernels >= 6.17.
Fixes:
[BRTEST# iptables --flush
modprobe: module ip_tables not found in modules.dep
iptables v1.8.11 (legacy): can't initialize iptables table `filter': Table does not exist (do you need to insmod?)
Perhaps iptables or your kernel needs to be upgraded.
On the other hand, when nftables compat (iptables-nft) is used by
default (BR2_PACKAGE_IPTABLES_NFTABLES_DEFAULT=y) we have to enable
nft protocol support in the kernel.
iptables --version
iptables: Failed to initialize nft: Protocol not supported
Enable CONFIG_NF_TABLES and CONFIG_NF_TABLES_INET as for
NFTABLES_LINUX_CONFIG_FIXUPS and complete the list with
CONFIG_NFT_SOCKET needed to pass the TestIptables with
nftables compat (iptables-nft) enabled.
Without CONFIG_NFT_SOCKET:
iptables --policy INPUT ACCEPT
iptables v1.8.11 (nf_tables): TABLE_ADD failed (Operation not supported): table filter
So, enable kernel support for iptables-legacy only if nftables compat
is not enabled by default. Enable iptables-nft support when nftables
compat is enabled, even if not used by default.
[1] https://git.kernel.org/pub/scm/linux/kernel/git/stable/linux.git/commit/?id=9fce66583f06c212e95e4b76dd61d8432ffa56b6
Signed-off-by: Romain Naour <romain.naour@smile.fr>
[Fiona: fix typo in commit message]
Signed-off-by: Fiona Klute <fiona.klute@gmx.de>
(cherry picked from commit c57bcf0d43)
Signed-off-by: Thomas Perale <thomas.perale@mind.be>
With an older cmake version, like the 3.25.1 as available in the docker
reference image, mosquitto fails to build when ccache is enabled:
[ 98%] Building CXX object lib/cpp/CMakeFiles/mosquittopp.dir/mosquittopp.cpp.o
In file included from [...]/buildroot/output/build/mosquitto-2.1.2/lib/cpp/mosquittopp.cpp:17:
[...]/buildroot/output/host/opt/ext-toolchain/i686-buildroot-linux-gnu/include/c++/15.1.0/cstdlib:83:15: fatal error: stdlib.h: No such file or directory
83 | #include_next <stdlib.h>
| ^~~~~~~~~~
compilation terminated.
Officially, mosquitto only requires cmake 3.18, but that proves to not
be enough, in fact...
We workaround that by requiring cmake 4.3, which is the one version that
could be tested with our host-cmake.
Signed-off-by: Yann E. MORIN <yann.morin@orange.com>
Cc: Peter Korsgaard <peter@korsgaard.com>
Cc: Titouan Christophe <titouan.christophe@mind.be>
Signed-off-by: Romain Naour <romain.naour@smile.fr>
(cherry picked from commit da9dcddff1)
Signed-off-by: Thomas Perale <thomas.perale@mind.be>
Libepoxy is a library for handling OpenGL function pointer management.
It has backends for egl/glx, which may at one point have been mandatory
to enable, but the library now builds with none of the above enabled
features, as seen below.
libepoxy 1.5.10
User defined options
Cross files : /home/joseph/br-test-pkg/arm-aarch64/build/libepoxy-1.5.10//buildroot-build/cross-compilation.conf
b_pie : false
b_staticpic : true
buildtype : release
build.cmake_prefix_path: /home/joseph/br-test-pkg/arm-aarch64/host/lib/cmake
default_library : shared
docs : false
egl : no
glx : no
libdir : lib
build.pkg_config_path : /home/joseph/br-test-pkg/arm-aarch64/host/lib/pkgconfig
prefix : /usr
strip : false
tests : false
x11 : false
Removing these dependencies allows for some applications that require it
as a build dependency, but otherwise can run headless or without GL, to
build and function, using other graphics APIs or display pipelines.
Weston, for example, can still use Vulkan and DRM when linked to
libepoxy without GL/EGL/X11 support.
Acked-by: Arnout Vanecappelle <arnout@rnout.be>
Signed-off-by: Joseph Kogut <joseph.kogut@gmail.com>
Signed-off-by: Romain Naour <romain.naour@smile.fr>
(cherry picked from commit cd2583ca0a)
Signed-off-by: Thomas Perale <thomas.perale@mind.be>
Upstream passt only documents runtime dependencies; and they advertise
being able to run on kernel 3.8 or later. However, they do not document
the build dependencies.
Since 2025_06_11.0293c6f, upstream requires kernel headers >= 5.9, as
they make use of linux/close_range.h, only introduced in 5.9.
Add a dependency to kernel headers, and propagate it to podman's passt
backend.
Fixes: 6a192b0d28
Cc: Yann E. MORIN <yann.morin@orange.com>
Signed-off-by: Romain Naour <romain.naour@smile.fr>
Signed-off-by: Peter Korsgaard <peter@korsgaard.com>
(cherry picked from commit 113def3696)
Signed-off-by: Thomas Perale <thomas.perale@mind.be>
Commit e8c54ffb3d ("utils/generate-cyclonedx: generate vcs
externalReferences for source repos") added externalReferences to the source
code of packages.
This unfortunately causes issues with packages (in br2-external) fetching
from git using the scp-like syntax, E.G.:
FOO_SITE_METHOD = git
FOO_SITE = git@github.com:<project>/<repo>.git
Which ends up in the SBOM as:
[
{
"type": "vcs",
"url": "git@github.com:<project>/<repo>.git",
"comment": "git repository"
}
]
This (correctly) causes Dependency track to reject the SBOM import with:
{
"status": 400,
"title": "The uploaded BOM is invalid",
"detail": "Schema validation failed",
"errors": [
"$.components[2].externalReferences[0].url: does not match the iri-reference pattern must be a valid RFC 3987 IRI-reference",
"$.components[2].externalReferences[0].url: does not match the iri-reference pattern must be a valid RFC 3987 IRI-reference",
"$.components[2].externalReferences[0].url: does not match the regex pattern ^urn:cdx:[0-9a-f]{8}-[0-9a-f]{4}-[0-9a-f]{4}-[0-9a-f]{4}-[0-9a-f]{12}/[1-9][0-9]*$",
]
}
The CycloneDX spec indeed requires a URI:
The URI (URL or URN) to the external reference. External references are
URIs and therefore can accept any URL scheme including https (RFC-7230),
mailto (RFC-2368), tel (RFC-3966), and dns (RFC-4501)
https://cyclonedx.org/docs/1.6/json/#metadata_tools_oneOf_i0_components_items_externalReferences_items_url
The user@host:project/repo.git is a git-specific shorthand for a git-over-ssh URL. From man git-clone:
Git supports ssh, git, http, and https protocols (in addition, ftp and ftps
can be used for fetching, but this is inefficient and deprecated; do not use
them).
The native transport (i.e. git:// URL) does no authentication and should
be used with caution on unsecured networks.
The following syntaxes may be used with them:
• ssh://[user@]host.xz[:port]/path/to/repo.git/
• git://host.xz[:port]/path/to/repo.git/
• http[s]://host.xz[:port]/path/to/repo.git/
• ftp[s]://host.xz[:port]/path/to/repo.git/
An alternative scp-like syntax may also be used with the ssh protocol:
• [user@]host.xz:path/to/repo.git/
So convert the scp-like syntax to ssh:// URLs in parse_uris() for spec
compliance.
Signed-off-by: Peter Korsgaard <peter@korsgaard.com>
Acked-By: Thomas Perale <thomas.perale@mind.be>
Signed-off-by: Peter Korsgaard <peter@korsgaard.com>
(cherry picked from commit ebcfdb8b0a)
Signed-off-by: Thomas Perale <thomas.perale@mind.be>
There are a number of runtime tests that checks that a command fails as
expected, so add an assertRunNotOk() similar to the existing assertRunOk()
to handle that instead of open coding it everywhere.
Signed-off-by: Peter Korsgaard <peter@korsgaard.com>
Reviewed-by: Fiona Klute <fiona.klute@gmx.de>
Signed-off-by: Peter Korsgaard <peter@korsgaard.com>
(cherry picked from commit 03783de150)
Signed-off-by: Thomas Perale <thomas.perale@mind.be>
Security fixes:
CVE-2026-53613 - mount(8) TOCTOU race on target path.
The SUID mount does not pin the mount target directory, allowing a
race between path resolution and the actual mount syscall. A local
attacker can swap an ancestor directory component between these
steps to redirect a mount to an arbitrary location.
Reported-by: Xinyao Hu
CVE-2026-53612 - mount(8) TOCTOU race on post-mount owner/mode change.
The X-mount.owner, X-mount.group, and X-mount.mode options use
path-based lchown()/chmod() after mounting. An attacker can swap
the target between mount and the ownership/mode change to gain
control of arbitrary files.
Reported-by: Xinyao Hu
CVE-2026-53614 - mount(8) SUID bypass via LIBMOUNT_FORCE_MOUNT2.
The environment variable LIBMOUNT_FORCE_MOUNT2 is not filtered
via safe_getenv() in SUID context. A local attacker can force
the legacy mount(2) code path, which uses a two-step bind+remount
or propagation sequence with a window where security flags (nosuid,
noexec, ...) are not yet applied.
Reported-by: Xinyao Hu
Full release notes: https://www.kernel.org/pub/linux/utils/util-linux/v2.41/v2.41.5-ReleaseNotes
Signed-off-by: Giulio Benetti <giulio.benetti@benettiengineering.com>
Signed-off-by: Peter Korsgaard <peter@korsgaard.com>
(cherry picked from commit 40ce6355c9)
Signed-off-by: Thomas Perale <thomas.perale@mind.be>
* Explicitly set shell type. Shellcheck doesn't know OpenRC, but the
script as such is POSIX shell.
* Override warnings not applicable in context.
Signed-off-by: Fiona Klute <fiona.klute@gmx.de>
Signed-off-by: Marcus Hoffmann <buildroot@bubu1.eu>
(cherry picked from commit 3e2cc4e46f)
Signed-off-by: Thomas Perale <thomas.perale@mind.be>
With the action function as the last command in the script its return
code automatically becomes that of the script, and without explicit
exit shellcheck does not complain about unused functions.
Also wait for the process to stop in "stop", and simplify restart.
Signed-off-by: Fiona Klute <fiona.klute@gmx.de>
Signed-off-by: Marcus Hoffmann <buildroot@bubu1.eu>
(cherry picked from commit b4884a2937)
Signed-off-by: Thomas Perale <thomas.perale@mind.be>
If sending the stop signal failed for whatever reason, waiting for an
existing PID file to disappear is likely to block indefinitely.
Signed-off-by: Fiona Klute <fiona.klute@gmx.de>
Tested-by: Andreas Ziegler <br025@umbiko.net>
Signed-off-by: Marcus Hoffmann <buildroot@bubu1.eu>
(cherry picked from commit b2d84525f9)
Signed-off-by: Thomas Perale <thomas.perale@mind.be>
The exit status of the last command automatically becomes the exit
status of the script. And if there is no explicit exit shellcheck
accepts unused functions (here: start/stop/... called via variable).
Signed-off-by: Fiona Klute <fiona.klute@gmx.de>
Tested-by: Andreas Ziegler <br025@umbiko.net>
Signed-off-by: Marcus Hoffmann <buildroot@bubu1.eu>
(cherry picked from commit 118ffb20b5)
Signed-off-by: Thomas Perale <thomas.perale@mind.be>
Upstream commit
a00a3cce3c
added the code of gli & glm in-tree and removed the usage as external
packages.
Signed-off-by: Bernd Kuhls <bernd@kuhls.net>
Signed-off-by: Julien Olivain <ju.o@free.fr>
(cherry picked from commit 8bcb156d33)
Signed-off-by: Thomas Perale <thomas.perale@mind.be>
Fixes build error not caught by the autobuilders with this defconfig:
BR2_x86_64=y
BR2_TOOLCHAIN_EXTERNAL=y
BR2_FORCE_HOST_BUILD=y
BR2_PER_PACKAGE_DIRECTORIES=y
BR2_PACKAGE_KODI=y
BR2_PACKAGE_KODI_SCREENSAVER_RSXS=y
BR2_PACKAGE_MESA3D=y
BR2_PACKAGE_MESA3D_GALLIUM_DRIVER_SOFTPIPE=y
BR2_PACKAGE_MESA3D_OPENGL_GLX=y
BR2_PACKAGE_MESA3D_OPENGL_EGL=y
BR2_PACKAGE_XORG7=y
BR2_PACKAGE_PYTHON3=y
BR2_PACKAGE_PYTHON3_PY_ONLY=y
BR2_PACKAGE_LIBUDEV_ZERO=y
Raised minimum version for all addons as requested by upstream.
Signed-off-by: Bernd Kuhls <bernd@kuhls.net>
Signed-off-by: Julien Olivain <ju.o@free.fr>
(cherry picked from commit 09fcae1588)
Signed-off-by: Thomas Perale <thomas.perale@mind.be>
Our docker image was finally updated to Debian 12 and now provide Qemu
7.2.15 [1]. We can safely revert this workaround for older Qemu version.
[1] e5bbe020ca
This reverts commit 37e23e0dd7.
Signed-off-by: Romain Naour <romain.naour@smile.fr>
Signed-off-by: Julien Olivain <ju.o@free.fr>
(cherry picked from commit 4834f18c69)
Signed-off-by: Thomas Perale <thomas.perale@mind.be>
The NVD database schema has the following entry
```
{
"vulnerable": true,
"criteria": "cpe:2.3:a:ntp:ntp:*:*:*:*:*:*:*:*",
"versionEndIncluding": "4.2.8",
},
```
Which make every patch revision of the package ntp match to the
CVE-2015-7977.
This commit ignore this entry.
Signed-off-by: Thomas Perale <thomas.perale@mind.be>
Signed-off-by: Julien Olivain <ju.o@free.fr>
(cherry picked from commit 00e4a03348)
Signed-off-by: Thomas Perale <thomas.perale@mind.be>
See the release notes:
https://docs.djangoproject.com/en/6.0/releases/6.0.6/
This fixes the following vulnerabilities:
- CVE-2026-6873 : Signed cookie salt namespace collision
- CVE-2026-7666 : Potential unencrypted email transmission via STARTTLS
in the SMTP backend
- CVE-2026-8404 : Potential exposure of private data via case-sensitive
Cache-Control directives
- CVE-2026-35193: Potential exposure of private data via missing
Vary: Authorization
- CVE-2026-48587: Potential exposure of private data via whitespace padding
in Vary header
Signed-off-by: Titouan Christophe <titouan.christophe@mind.be>
Signed-off-by: Julien Olivain <ju.o@free.fr>
(cherry picked from commit 00b9069f46)
Signed-off-by: Thomas Perale <thomas.perale@mind.be>
Fixes the following security issues:
Fixed heap use-after-free in PKCS7_verify().
(CVE-2026-45447)
Fixed CMS AuthEnvelopedData processing may accept forged messages.
(CVE-2026-34182)
Fixed unbounded memory growth in the QUIC PATH_CHALLENGE handler.
(CVE-2026-34183)
Fixed double-free when checking OCSP stapled response.
(CVE-2026-35188)
Fixed NULL pointer dereference in QUIC server initial packet handling.
(CVE-2026-42764)
Fixed AES-OCB IV ignored on EVP_Cipher() path.
(CVE-2026-45445)
Fixed possible heap buffer overflow in ASN.1 multibyte string conversion.
(CVE-2026-7383)
Fixed out-of-bounds read in CMS password-based decryption.
(CVE-2026-9076)
Fixed heap buffer over-read in ASN.1 content parsing.
(CVE-2026-34180)
Fixed PKCS#12 files with PBMAC1 are accepted with short HMAC keys.
(CVE-2026-34181)
Fixed NULL dereference in certificate verification with OCSP Checking.
(CVE-2026-42765)
Fixed possible NULL dereference in password-dased CMS decryption.
(CVE-2026-42766)
Fixed NULL pointer dereference in CRMF EncryptedValue decryption.
(CVE-2026-42767)
Fixed multi-RecipientInfo Bleichenbacher Oracle in CMS_decrypt()
and PKCS7_decrypt().
(CVE-2026-42768)
Fixed trust anchor substitution via cert/issuer typo in CMP
rootCaKeyUpdate.
(CVE-2026-42769)
Fixed FFC-DH peer validation uses attacker-supplied q.
(CVE-2026-42770)
Fixed incorrect tag processing for empty messages in AES-GCM-SIV
and AES-SIV modes.
(CVE-2026-45446)
For more details, see the release notes and advisory:
https://github.com/openssl/openssl/releases/tag/openssl-3.6.3https://openssl-library.org/news/secadv/20260609.txt
Signed-off-by: Peter Korsgaard <peter@korsgaard.com>
Signed-off-by: Julien Olivain <ju.o@free.fr>
(cherry picked from commit b0ea6e310f)
Signed-off-by: Thomas Perale <thomas.perale@mind.be>
Fixes the following security issues:
*) SECURITY: CVE-2026-49975: mod_http2 denial of service
(cve.mitre.org)
Memory Allocation with Excessive Size Value vulnerability in
Apache HTTP Server's mod_http leads to denial of service via
malicious HTTP requests.
This issue affects Apache HTTP Server: from 2.4.17 through
2.4.67.
Credits: Quang Luong of Calif.IO in collaboration with OpenAI
Codex
*) SECURITY: CVE-2026-48913: mod_http2 memory corruption when file
handles exhausted (cve.mitre.org)
Use After Free vulnerability in Apache HTTP Server module
mod_http2 when file handles are already exhausted.
This issue affects Apache HTTP Server: from 2.4.55 through
2.4.67.
Credits: Sam Lovejoy, IBM X-Force Offensive Research (XOR)
*) SECURITY: CVE-2026-44631: Heap Underflow in `ap_regname` via
Signed Char Overflow (cve.mitre.org)
Buffer Underwrite vulnerability in Apache HTTP Server on crafted
regular expressions in the configuration.
This issue affects Apache HTTP Server: from 2.4.0 through 2.4.67.
Users are recommended to upgrade to version 2.4.68, which fixes
the issue.
Credits: Zhenpeng (Leo) Lin at depthfirst
*) SECURITY: CVE-2026-44186: Loop in `proxy_ftp_handler` in
mod_proxy_ftp (cve.mitre.org)
Loop with Unreachable Exit Condition ('Infinite Loop')
vulnerability in the mod_proxy_ftp module in Apache HTTP Server
with an attacker controlled backend FTP server.
This issue affects undefined: from 2.4.0 through 2.4.67.
Users are recommended to upgrade to version 2.4.68, which fixes
the issue.
Credits: Zhenpeng (Leo) Lin at depthfirst
*) SECURITY: CVE-2026-44185: Stack Buffer Over-Read in mod_ssl OCSP
`send_request` (cve.mitre.org)
Buffer Over-read vulnerability in Apache HTTP Server via
outbound OCSP requests to an attacker controlled OCSP server
This issue affects Apache HTTP Server: from 2.4.0 through 2.4.67.
Users are recommended to upgrade to version 2.4.68, which fixes
the issue.
Credits: Zhenpeng (Leo) Lin at depthfirst
*) SECURITY: CVE-2026-44119: escalation of privilege through
expressions in .htaccess in multiple modules (cve.mitre.org)
Improper Privilege Management vulnerability in Apache HTTP
Server 2.4.67 and earlier allows local .htaccess authors to read
files with the privileges of the httpd user.
This issue affects Apache HTTP Server: from through 2.4.67.
Users are recommended to upgrade to version 2.4.68, which fixes
the issue.
Credits: Lucian Nitescu
*) SECURITY: CVE-2026-43951: OOB Read in `merge_response_headers`
can cause crash (cve.mitre.org)
Out-of-bounds Read vulnerability in Apache HTTP Server with
mod_headers and mod_mime and multiple response languages.
This issue affects Apache HTTP Server: from 2.4.0 through 2.4.67.
Credits: Zhenpeng (Leo) Lin at depthfirst
*) SECURITY: CVE-2026-42536: mod_xml2enc heap overflow
(cve.mitre.org)
Heap-based Buffer Overflow vulnerability in Apache HTTP Server
with mod_xml2enc, xml2StartParse, and untrusted content
This issue affects Apache HTTP Server: from 2.4.0 through 2.4.67.
Users are recommended to upgrade to version 2.4.68, which fixes
the issue.
Credits: Zhenpeng (Leo) Lin at depthfirst
*) SECURITY: CVE-2026-42535: mod_dav_fs protected directory access
(cve.mitre.org)
A path handling issue in mod_dav_fs in Apache 2.4.67 and
earlier allows a WebDAV content author to directly manipulate
trusted DAV property databases, potentially causing child
process crashes.
Users are recommended to upgrade to version 2.4.68, which fixes
this issue.
Credits: Zhenpeng (Leo) Lin at depthfirst
*) SECURITY: CVE-2026-34356: ProxyPassReverseCookieMap buffer
overflow (cve.mitre.org)
Heap-based Buffer Overflow vulnerability in Apache HTTP Server
with malicious backend servers and ProxyPassReverseCookie*
This issue affects Apache HTTP Server: from 2.4.0 through 2.4.67.
Users are recommended to upgrade to version 2.4.68, which fixes
the issue.
Credits: Arkadi Vainbrand
*) SECURITY: CVE-2026-34355: mod_proxy_html buffer overflow
(cve.mitre.org)
A buffer overflow in mod_proxy_html in Apache HTTP Server 2.4.67
and earlier allows an attack by an untrusted backend.
Users are recommended to upgrade to version 2.4.68, which fixes
this issue.
Credits: Elhanan Haenel
*) SECURITY: CVE-2026-29170: mod_proxy_ftp XSS (cve.mitre.org)
A cross-site scripting vulnerability exists in mod_proxy_ftp's
HTML directory list generation in Apache HTTP Server 2.4.67 and
earlier when listing FTP directory contents either via forward
or reverse proxy configuration.
Users are recommended to upgrade to version 2.4.68, which fixes
this issue.
Credits: Pavel Kohout, Aisle Research, Aisle.com
*) SECURITY: CVE-2026-29167: mod_ldap per-dir use-after-free
(cve.mitre.org)
Use After Free vulnerability in Apache HTTP Server with mod_ldap
in per-directory configuration
This issue affects Apache HTTP Server: from 2.4.0 through 2.4.67.
Users are recommended to upgrade to version 2.4.68, which fixes
the issue.
Credits: Pavel Kohout, Aisle Research, Aisle.com
For more details, see the CHANGES file:
https://downloads.apache.org/httpd/CHANGES_2.4.68
Signed-off-by: Peter Korsgaard <peter@korsgaard.com>
Signed-off-by: Julien Olivain <ju.o@free.fr>
(cherry picked from commit 07a690f00b)
Signed-off-by: Thomas Perale <thomas.perale@mind.be>
See the release notes:
https://github.com/redis/redis/blob/8.6.4/00-RELEASENOTES
This fixes the following vulnerabilities:
- CVE-2026-23479:
Redis is an in-memory data structure store. In redis-server from 7.2.0
until 8.6.3, the unblock client flow does not handle an error return
from `processCommandAndResetClient` when re-executing a blocked
command. If a blocked client is evicted during this flow, an
authenticated attacker can trigger a use-after-free that may lead to
remote code execution. This has been patched in version 8.6.3.
https://www.cve.org/CVERecord?id=CVE-2026-23479
- CVE-2026-23631:
Redis is an in-memory data structure store. In all versions of redis-
server with Lua scripting, an authenticated attacker can exploit the
master-replica synchronization mechanism to trigger a use-after-free
on replicas where replica-read-only is disabled or can be disabled,
which may lead to remote code execution. A workaround is to prevent
users from executing Lua scripts or avoid using replicas where
replica-read-only is disabled. This is patched in version 8.6.3.
https://www.cve.org/CVERecord?id=CVE-2026-23631
- CVE-2026-25243:
Redis is an in-memory data structure store. In versions of redis-
server up to 8.6.3, the RESTORE command does not properly validate
serialized values. An authenticated attacker with permission to
execute RESTORE can supply a crafted serialized payload that triggers
invalid memory access and may lead to remote code execution. A
workaround is to restrict access to the RESTORE command with ACL
rules. This is patched in version 8.6.3.
https://www.cve.org/CVERecord?id=CVE-2026-25243
- CVE-2026-25588:
RedisTimeSeries is a time-series module for Redis. In all versions
before 1.12.14 of RedisTimeSeries, the module does not properly
validate serialized values processed through the Redis RESTORE
command. An authenticated attacker with permission to execute RESTORE
on a server with the RedisTimeSeries module loaded can supply a
crafted serialized payload that triggers invalid memory access and may
lead to remote code execution. A workaround is to restrict access to
the RESTORE command with ACL rules. This has been patched in version
1.12.14.
https://www.cve.org/CVERecord?id=CVE-2026-25588
- CVE-2026-25589:
RedisBloom is a probabilistic data structures module for Redis. In all
versions of RedisBloom before 2.8.20, the module does not properly
validate serialized values processed through the Redis RESTORE
command. An authenticated attacker with permission to execute RESTORE
on a server with the RedisBloom module loaded can supply a crafted
serialized payload that triggers invalid memory access and may lead to
remote code execution. A workaround is to restrict access to the
RESTORE command with ACL rules. This issue is fixed in version 2.8.20.
https://www.cve.org/CVERecord?id=CVE-2026-25589
Signed-off-by: Titouan Christophe <titouan.christophe@mind.be>
Signed-off-by: Peter Korsgaard <peter@korsgaard.com>
(cherry picked from commit be7b7821c6)
Signed-off-by: Thomas Perale <thomas.perale@mind.be>
Since the runc security bump to version 1.3.5 [1], the TestOci fail due
to missing user namespace support in the kernel:
proc/self/setgroups: no such file or directory
The test was working well with runc 1.3.0. The regression is caused by
this commit [2] from the 1.3.3 security release.
The regression is fixed by a refactoring from the 1.4.1 release [3].
Backport this commit on top of runc 1.3.5 (fixing some conflicts).
Fixes:
https://gitlab.com/buildroot.org/buildroot/-/jobs/14696525946 (TestOci)
[1] e013e2df84
[2] 7762edc82c
[3] 323a54ef0d
Signed-off-by: Romain Naour <romain.naour@smile.fr>
Signed-off-by: Julien Olivain <ju.o@free.fr>
The used Linux kernel (4.4.144) does not contain the default license
files as those were only added in 4.16 with commit e00a844aca
("LICENSES: Add Linux syscall note exception"), so specify the correct
license file to fix:
make legal-info
..
cp: cannot stat '/path/to/output/build/linux-headers-custom/LICENSES/preferred/GPL-2.0': No such file or directory
And add the sha256sum to the .hash file.
Enable BR2_DOWNLOAD_FORCE_CHECK_HASHES.
Fixes:
https://gitlab.com/buildroot.org/buildroot/-/jobs/14728913808 (arcturus_ucp1020_defconfig)
Signed-off-by: Romain Naour <romain.naour@smile.fr>
Cc: Michael Durrant <mdurrant@ArcturusNetworks.com>
[Julien: remove .checkpackageignore entry to fix check-package error]
Signed-off-by: Julien Olivain <ju.o@free.fr>
When using a specific git repo and version for at91bootstrap3,
BR2_TARGET_AT91BOOTSTRAP3_LICENSE_FILES defaults to "LICENSES/MIT.txt".
However the git version we use (namely v3.10.3) does not provide this
file. Actually, it does not provide a license file at all. This causes
‘make legal-info’ to fail with:
>>> at91bootstrap3 v3.10.3 Collecting legal info
sha256sum: /builds/buildroot.org/buildroot/output/build/at91bootstrap3-v3.10.3/LICENSES/MIT.txt: No such file or directory
ERROR: while checking hashes from boot/at91bootstrap3/at91bootstrap3.hash
ERROR: LICENSES/MIT.txt has wrong sha256 hash:
ERROR: expected: 5a3809b1c2ba13b7242572322951311c584419f1f8516f665d6c06f0668d78de
ERROR: got :
ERROR: Incomplete download, or man-in-the-middle (MITM) attack
make[1]: *** [boot/at91bootstrap3/at91bootstrap3.mk:112: at91bootstrap3-legal-info] Error 1
Let's be explicit that there is no license file to check.
Fixes:
https://gitlab.com/buildroot.org/buildroot/-/jobs/14728913821 (at91sam9x5ek_mmc_dev_defconfig)
https://gitlab.com/buildroot.org/buildroot/-/jobs/14728913820 (at91sam9x5ek_mmc_defconfig)
https://gitlab.com/buildroot.org/buildroot/-/jobs/14728913819 (at91sam9x5ek_dev_defconfig)
https://gitlab.com/buildroot.org/buildroot/-/jobs/14728913818 (at91sam9x5ek_defconfig)
Signed-off-by: Romain Naour <romain.naour@smile.fr>
Signed-off-by: Julien Olivain <ju.o@free.fr>
Fixes the following security issues:
CVE-2026-23679: libusb before version 1.0.30 contains a NULL pointer
dereference vulnerability that allows attackers to crash applications by
supplying a malformed USB configuration descriptor where an interface claims
bNumEndpoints greater than zero but is followed by a class-specific
descriptor whose bLength exceeds the remaining buffer size, causing
parse_interface() to return early without allocating the endpoint array.
Attackers can exploit this flaw through libusb_get_active_config_descriptor
or libusb_get_config_descriptor by providing crafted descriptors via
virtualized USB passthrough, file-based descriptor parsing, or network
sources, causing any application iterating over endpoints to dereference a
NULL endpoint pointer and crash.
https://nvd.nist.gov/vuln/detail/CVE-2026-23679
CVE-2026-47104: libusb before version 1.0.30 contains a one-byte
out-of-bounds read vulnerability in parse_iad_array() in descriptor.c that
allows attackers to trigger a denial of service by supplying a malformed USB
descriptor whose bLength equals size minus one, causing the bounds check to
use the original buffer size instead of the remaining size. Attackers in
virtualized environments with USB passthrough can supply crafted descriptors
through libusb_get_active_interface_association_descriptors or
libusb_get_interface_association_descriptors to read one byte past the end
of the malloc allocation, resulting in a denial of service.
https://nvd.nist.gov/vuln/detail/CVE-2026-47104
For more details, see the announcement:
https://sourceforge.net/p/libusb/mailman/message/59335553/
Signed-off-by: Peter Korsgaard <peter@korsgaard.com>
Signed-off-by: Julien Olivain <ju.o@free.fr>
https://github.com/strukturag/libde265/releases/tag/v1.1.1
Fixes the following security problems:
CVE TBD (GHSA-ccfw-29x7-rrx3)
- Pixel accessor signed integer overflow causes heap OOB read/write
CVE TBD (GHSA-j2qq-x2xq-g9wr)
- SAO sequential filter heap buffer overflow via signed integer overflow
This version bump includes upstream commit
9ded37bda4
which uses constexpr() and causes a build error caught by the Gitlab
pipelines with the gcc-6-based bootlin-aarch64-glibc-old defconfig:
/builds/bkuhls/buildroot/br-test-pkg/bootlin-aarch64-glibc-old/build/libde265-1.1.1/libde265/deblock.cc:594:14:
error: expected ‘(’ before ‘constexpr’
if constexpr (sizeof(pixel_t)==1) {
Therefore we need to raise the minimum gcc version according to
https://gcc.gnu.org/projects/cxx-status.html#cxx17 to gcc 7.
Signed-off-by: Bernd Kuhls <bernd@kuhls.net>
Signed-off-by: Julien Olivain <ju.o@free.fr>
Fixes the following security issues:
- Parse the chunk-size with a dedicated function and reject "unreasonably"
large values to prevent silent truncation by sscanf(), integer overflows
and misinterpretation of the content later on. Heap buffer overflows on
platforms with 32-bit pointers were alleged as well.
Commit 5b3bb22b77. OVE-20260515-0002. Reported by @TristanInSec.
- ssl_send_certificate_error(): Store the generated message on the heap
instead of the stack to prevent an alleged segmentation fault if there
are enough certificates in the chain to exceed the stack size.
While at it, replace another variable-length array that was probably
unproblematic with a heap-based buffer as well.
Commit 4963aa4f08. OVE-20260515-0001. Reported by @TristanInSec.
https://www.privoxy.org/gitweb/?p=privoxy.git;a=blob;f=ChangeLog;h=d62aa6bf0b2cb26100e4ba8e528638259502711d;hb=0c5225b6844dd1a838b80d09d715a6c4ccbda2c6
Signed-off-by: Bernd Kuhls <bernd@kuhls.net>
[Peter: add vulnerability info]
Signed-off-by: Peter Korsgaard <peter@korsgaard.com>
This commit fixes the following vulnerability:
- CVE-2026-7598:
A security vulnerability has been detected in libssh2 up to 1.11.1.
The impacted element is the function userauth_password of the file
src/userauth.c. Such manipulation of the argument
username_len/password_len leads to integer overflow. The attack may be
launched remotely. The name of the patch is
256d04b60d80bf1190e96b0ad1e91b2174d744b1. A patch should be applied to
remediate this issue.
For more information, see:
- https://www.cve.org/CVERecord?id=CVE-2026-7598
- 256d04b60d
Signed-off-by: Thomas Perale <thomas.perale@mind.be>
Signed-off-by: Peter Korsgaard <peter@korsgaard.com>
defconfigs are very unlikely to successfully build on a small runner
because they build a kernel (and often a toolchain). They're also likely
to benefit a lot from the additional parallelism on larger runners.
For now, always build them on large runners. There may be some for which
even the large runners don't have sufficient disk space or memory, but
we'll solve that when it happens.
Signed-off-by: Arnout Vandecappelle <arnout@rnout.be>
Signed-off-by: Romain Naour <romain.naour@smile.fr>
Fixes a build error
output/per-package/sane-airscan/host/opt/ext-toolchain/bin/../lib/gcc/sparc-buildroot-linux-uclibc/14.3.0/../../../../sparc-buildroot-linux-uclibc/bin/ld:
libsane-airscan.so.1.p/airscan-http.c.o: in function `http_data_ref':
airscan-http.c:(.text+0x1c88): undefined reference to `__sync_fetch_and_add_4'
output/per-package/sane-airscan/host/opt/ext-toolchain/bin/../lib/gcc/sparc-buildroot-linux-uclibc/14.3.0/../../../../sparc-buildroot-linux-uclibc/bin/ld:
libsane-airscan.so.1.p/airscan-http.c.o: in function `http_data_unref':
airscan-http.c:(.text+0x1cd0): undefined reference to `__sync_sub_and_fetch_4'
output/per-package/sane-airscan/host/opt/ext-toolchain/bin/../lib/gcc/sparc-buildroot-linux-uclibc/14.3.0/../../../../sparc-buildroot-linux-uclibc/bin/ld:
libsane-airscan.so.1.p/airscan-trace.c.o: in function `trace_ref':
airscan-trace.c:(.text+0x32c): undefined reference to `__sync_fetch_and_add_4'
output/per-package/sane-airscan/host/opt/ext-toolchain/bin/../lib/gcc/sparc-buildroot-linux-uclibc/14.3.0/../../../../sparc-buildroot-linux-uclibc/bin/ld:
libsane-airscan.so.1.p/airscan-trace.c.o: in function `trace_unref':
airscan-trace.c:(.text+0x358): undefined reference to `__sync_sub_and_fetch_4'
with this defconfig
BR2_sparc=y
BR2_TOOLCHAIN_EXTERNAL=y
BR2_TOOLCHAIN_EXTERNAL_BOOTLIN_SPARCV8_UCLIBC_STABLE=y
BR2_PACKAGE_SANE_AIRSCAN=y
detected by the Gitlab pipelines while testing to bump of sane-backends
to 1.4.0 in this series.
The build error is caused by an upstream commit added in 2020 to version
0.99.14:
fccd8402a6
so a backport to LTS branches should be considered because the initial
version of the buildroot package was 0.99.33, added with commit
f78280bf26.
An autobuilder error was not recorded yet because it is masked by various
build errors of the sane-backends package which are resolved by its bump
to 1.4.0 in this series.
Signed-off-by: Bernd Kuhls <bernd@kuhls.net>
Signed-off-by: Arnout Vandecappelle <arnout@rnout.be>
Since this script is often used to bump kernel versions in multiple
Buildroot branches, it makes sense to simply commit changes directly
rather than letting the developer do it by hand.
Signed-off-by: Titouan Christophe <titouan.christophe@mind.be>
Signed-off-by: Arnout Vandecappelle <arnout@rnout.be>
Buildroot commit 49a4dc9745 added a patch
from the master branch which was now cherry-picked to the 2.43 branch.
Update the upstream URL accordingly.
Signed-off-by: Bernd Kuhls <bernd@kuhls.net>
Signed-off-by: Julien Olivain <ju.o@free.fr>
The 'show-info' output always the location relative to the Buildroot
root directory.
When running 'generate-cyclonedx' outside of the Buildroot root
directory the hash file locations are not correct. Only using the
'hash_file' variable coming from 'show-info' doesn't guarantee the
script to succeed.
Use the 'brpath' variable to correctly reference the absolute path.
Fixes: 1791b79422 utils/generate-cyclonedx: add hashes from .hash files to externalReferences
Signed-off-by: Thomas Perale <thomas.perale@mind.be>
Signed-off-by: Arnout Vandecappelle <arnout@rnout.be>
Fixes:
https://autobuild.buildroot.net/results/9f0f50858b2f41c306f172bf011a34d2c0ad65dc/
>>> zsh 5.9 Downloading
wget -nd -t 3 --no-check-certificate -O '/home/autobuild/autobuild/instance-42/output-1/build/.zsh-5.9.tar.xz.FpXHXy/output' 'http://www.zsh.org/pub/zsh-5.9.tar.xz'
URL transformed to HTTPS due to an HSTS policy
--2026-06-01 01:46:35-- https://www.zsh.org/pub/zsh-5.9.tar.xz
Loaded CA certificate '/etc/ssl/certs/ca-certificates.crt'
Resolving www.zsh.org (www.zsh.org)... 94.142.241.90
Connecting to www.zsh.org (www.zsh.org)|94.142.241.90|:443... connected.
HTTP request sent, awaiting response... 404 Not Found
2026-06-01 01:46:36 ERROR 404: Not Found.
zsh-5.9.1 was released on 2026-05-31 and 5.9.0 release tarball moved under
old/, so update ZSH_SITE to match.
https://zsh.sourceforge.io/News/
Signed-off-by: Peter Korsgaard <peter@korsgaard.com>
Signed-off-by: Julien Olivain <ju.o@free.fr>
OpenCV probes the host compiler for LSX/LASX by trying to compile a
small test program with '-mlsx' / '-mlasx'. With Buildroot's toolchain
this probe succeeds even when the target CPU lacks the matching ISA
extension, and the resulting libraries then contain LSX/LASX
instructions. This causes SIGILL at runtime on, e.g., the LA264.
Map Buildroot's BR2_LOONGARCH_SIMD_* selection to OpenCV's
CPU_BASELINE / CPU_DISPATCH knobs:
BR2_LOONGARCH_SIMD_NONE -> no baseline, no dispatch
BR2_LOONGARCH_SIMD_LSX -> baseline = LSX, no dispatch
BR2_LOONGARCH_SIMD_LASX -> baseline = LSX, dispatch = LASX
The block is gated on BR2_loongarch64, so the existing auto detection
remains in effect for every other architecture.
Signed-off-by: Pengji Li <wjjsn@qq.com>
Reviewed-by: Woodrow Douglass <wdouglass@carnegierobotics.com>
Signed-off-by: Arnout Vandecappelle <arnout@rnout.be>
Since Buildroot commit 0e3ddc9dc8,
linux hash files are split between pre- and post-6.17.
With buildroot commit da01b7271a the
script was updated for the new situation but still needs to update the
version-numbered links to the directories with the correct hash files.
Signed-off-by: Bernd Kuhls <bernd@kuhls.net>
Signed-off-by: Arnout Vandecappelle <arnout@rnout.be>
Our CI uses "/builds/buildroot.org/buildroot" as build directory.
Unlikely the xfsprogs build system misbehave when a directory in
the path contain ".o".
While generating .ltdep, the sed command used to convert object file
(.o) to libtool object(.lo) replace buildroot.org by buildroot.lorg.
.ltdep: $(CFILES) $(HFILES)
$(Q)$(MAKEDEP) $(CFILES) | $(SED) -e 's,^\([^:]*\)\.o,\1.lo,' > .ltdep
Building libfrog
[CC] gen_crc32table
[GENERATE] crc32table.h
gmake[4]: *** No rule to make target '/builds/buildroot.lorg/buildroot/test-output/TestXfs/host/include/urcu.h', needed by 'avl64.lo'. Stop.
Update the sed command to avoid this effect.
Fixes:
https://gitlab.com/buildroot.org/buildroot/-/jobs/14607335648
Signed-off-by: Romain Naour <romain.naour@smile.fr>
Signed-off-by: Julien Olivain <ju.o@free.fr>
Buildroot commit cdd1c5ca55 bumped the
package from version 22.12.0 to 25.10.0 but forgot to change zlib into
a mandatory dependency. This is necessary due to upstream commit
7d87c7d2c6
since version 23.07.0.
Fixes:
https://autobuild.buildroot.net/results/85f/85fb6c2945101b8d4ee86dbc32700293e7b35a86/
CMake Error at /usr/share/cmake/Modules/FindPackageHandleStandardArgs.cmake:290 (message):
Could NOT find ZLIB (missing: ZLIB_LIBRARY ZLIB_INCLUDE_DIR)
Call Stack (most recent call first):
/usr/share/cmake/Modules/FindPackageHandleStandardArgs.cmake:654 (_FPHSA_FAILURE_MESSAGE)
/usr/share/cmake/Modules/FindZLIB.cmake:242 (find_package_handle_standard_args)
CMakeLists.txt:309 (find_package)
Signed-off-by: Bernd Kuhls <bernd@kuhls.net>
Signed-off-by: Peter Korsgaard <peter@korsgaard.com>
Remove a stale patch which was not removed when the cppdb package was
removed by buildroot commit b7143b2e22.
Signed-off-by: Bernd Kuhls <bernd@kuhls.net>
Signed-off-by: Thomas Petazzoni <thomas.petazzoni@bootlin.com>
The previous site went offline, the last entry dates back to April 2026:
https://web.archive.org/web/20260401000000*/http://www.auto.tuwien.ac.at/~mkoegler/pth/
Update _SITE to the bcusdk project which depends on libpthsem and stores
the original tarball. Update project URL to github mirror provided by the
linknx project which also depends on libpthsem.
Fixes download error:
ERROR: while checking hashes from package/libpthsem/libpthsem.hash
ERROR: pthsem_2.0.8.tar.gz has wrong sha256 hash:
ERROR: expected: 4024cafdd5d4bce2b1778a6be5491222c3f6e7ef1e43971264c451c0012c5c01
ERROR: got : 01d9027268f27aab3ca5c6c649a7f7a444db5bc889e496d80c8704e4e120346e
ERROR: Incomplete download, or man-in-the-middle (MITM) attack
Fixes:
https://autobuild.buildroot.net/results/0d9/0d9e957540d15302ac55bc5a2207db0c45279b37/
Signed-off-by: Bernd Kuhls <bernd@kuhls.net>
Signed-off-by: Thomas Petazzoni <thomas.petazzoni@bootlin.com>
Since the ARM AArch64 toolchain toolchain bump [1], the TestPppd fail
at runtime since ttyppp0 and ttyppp1 interfaces were not created
properly:
pppd[87]: pppd 2.5.2 started by root, uid 0
pppd[87]: Baud rate for /dev/ttyppp1 is 0; need explicit baud rate
The new toolchain uses glibc 2.42 that include a rework in termios
"implement arbitrary and split speeds in termios" to support BOTHER
[2]. This rework seems to conflict with pppd workaround [3] introduced
when BOTHER was not supported in Glibc.
Fix this by setting the baudrate on pppd command line (we already set
this baudrate on socat command line).
Fixes:
https://gitlab.com/buildroot.org/buildroot/-/jobs/14607335920 (TestPppd)
[1] 8d413d6179
[2] https://sourceware.org/git/?p=glibc.git;a=commit;h=5cf101a85aae0d703cdd8ed7b25fe288e41fdacb
[3] d65f6713c8
Fix-suggested-by: Julien Olivain <ju.o@free.fr>
Signed-off-by: Romain Naour <romain.naour@smile.fr>
Signed-off-by: Julien Olivain <ju.o@free.fr>
Remove some patches that have been applied upstream, or adapt them
for upstream files that have been moved around.
Patch 0001 is no longer needed: a similar upstream patch is fixing this
issue. See [1]. The .checkpackageignore entry is also removed.
The COPYING license file was updated in [2]. This commit updates this
license file hash. Since the GPL-2.0 license text was moved to the
package file LICENSES/GPL-2.0, this commit also adds this new file in
XEN_LICENSE_FILES and its hash.
This commit also adds --disable-werror in XEN_CONF_OPTS. The code is
generating warnings with newer gcc version. This makes the compilation
works in all configurations.
This commit adds a comment in hash file about pgp signature check.
This fixes many vulnerabilities:
- CVE-2021-28687
- CVE-2021-28690
- CVE-2021-28693
- CVE-2021-28697
- CVE-2021-28702
- CVE-2021-28704
- CVE-2021-28707
- CVE-2021-28708
- CVE-2022-26357
- CVE-2022-33746
- CVE-2022-42331
- CVE-2022-42333
- CVE-2022-42334
- CVE-2023-34321
- CVE-2023-34322
- CVE-2023-34323
- CVE-2023-46837
- CVE-2024-31142
- CVE-2025-27466
- CVE-2025-58142
- CVE-2025-58143
- CVE-2025-58144
- CVE-2025-58145
Note: xen version 4.19.5 is not the latest at the time of this commit.
It is an intermediate bump because: 1. the xen build has significantly
changed after this 4.19.5 version, so this intermediate step will help
future updates; 2. this intermediate version includes many CVE
security fixes; and 3. it also reduces the number of package patches.
[1] https://xenbits.xen.org/gitweb/?p=qemu-xen.git;a=commitdiff;h=03556ea920b23c466ce7c1283199033de33ee671
[2] https://xenbits.xen.org/gitweb/?p=xen.git;a=commitdiff;h=7b068ac89024308862c4f448dd248645d2b8e882
Co-authored-by: Vincent Stehlé <vincent.stehle@arm.com>
Signed-off-by: Titouan Christophe <titouan.christophe@mind.be>
Tested-by: Julien Olivain <ju.o@free.fr>
Reviewed-by: Julien Olivain <ju.o@free.fr>
[Julien:
- reorder XEN_DEPENDENCIES alphabetically
- fix COPYING license hash
- add LICENSES/GPL-2.0 in XEN_LICENSE_FILES
- add commit log comment about --disable-werror
- add commit log note about the intermediate version
- drop patch 0001
- renumber patches
- remove all .checkpackageignore entries
- add "Upstream:" tag in all remaining patches
- add pgp signature check comment in hash file
]
Signed-off-by: Julien Olivain <ju.o@free.fr>
All Qt6 packages install their own SPDX SBOM in
$(TARGET_DIR)/usr/lib/qt6/sbom/. In the context of Buildroot having
such SBOMs on the target is not useful, and they take up some space,
so get rid of them.
We use a TARGET_FINALIZE_HOOKS (and not a POST_INSTALL_TARGET_HOOKS)
because it's not just qt6base that installs SBOMs, but all qt6
modules, so we want the cleanup to happen after they all got
installed.
Signed-off-by: Thomas Petazzoni <thomas.petazzoni@bootlin.com>
Signed-off-by: Julien Olivain <ju.o@free.fr>
Using '$(Q)rm -rf' is not the typical thing we do in Buildroot, we
more commonly use '$(RM) -rf'.
Signed-off-by: Thomas Petazzoni <thomas.petazzoni@bootlin.com>
Signed-off-by: Julien Olivain <ju.o@free.fr>
iconv types are defined differently in glibc (as pointers) and uclibc
(as integers). With changes in GCC14, -Wint-conversion has now become
an error, which shed some light on the issue.
The actual fix for that problem is released in uclibc 1.0.58 [1].
However, because these type definitions are in toolchain headers,
this means that the toolchain used to build samba must also include
uclibc>=1.0.58 (either an external toolchain that includes the uclibc fix,
or a Buildroot toolchain after the uclibc fix is merged in Buildroot [2]).
Until then, provide a workaround for samba itself.
No autobuilder failure on this (yet). It can be reproduced with
> ./utils/test-pkg -p samba4 -T bootlin-armv5-uclibc
[1] 328e14e55f
[2] https://lore.kernel.org/buildroot/ahPrm_0gVDGw5B5-@waldemar-brodkorb.de/
Assisted-by: Claude:claude-opus-4.8
Signed-off-by: Titouan Christophe <titouan.christophe@mind.be>
Signed-off-by: Marcus Hoffmann <buildroot@bubu1.eu>
Seen with this defconfig
BR2_x86_64=y
BR2_GCC_VERSION_15_X=y
BR2_TOOLCHAIN_BUILDROOT_CXX=y
BR2_PACKAGE_PICOTOOL=y
output/host/x86_64-buildroot-linux-gnu/sysroot/usr/include/bits/struct_mutex.h:35:9:
error: declaration does not declare anything [-fpermissive]
35 | short __unused;
No related autobuilder error was recorded.
The build error does not occur with glibc-2.42 on the 2026.02.x branch.
The build error was reported to picotool upstream:
https://github.com/raspberrypi/picotool/issues/300
Signed-off-by: Bernd Kuhls <bernd@kuhls.net>
Signed-off-by: Thomas Petazzoni <thomas.petazzoni@bootlin.com>
Fixes the following security issue (in 2.8.10):
CVE-2026-35444: Heap buffer overflow READ via unchecked colormap index in
XCF loader
https://github.com/libsdl-org/SDL_image/security/advisories/GHSA-gq8w-x74c-h6p7
In addition, 2.8.12 includes a number of memory related bugfixes:
Fixed memory overflow with corrupt LBM image
Fixed crash when decoding an invalid XCF image
Fixed out of bound read in GIF decoder
Update hash of license file for change of copyright year with:
281b4ebcb0
Signed-off-by: Peter Korsgaard <peter@korsgaard.com>
Signed-off-by: Thomas Petazzoni <thomas.petazzoni@bootlin.com>
Update rtl8822cs driver latest of the jethome-iot/rtl88x2cs.
Signed-off-by: Viacheslav Bocharov <v@baodeep.com>
Signed-off-by: Thomas Petazzoni <thomas.petazzoni@bootlin.com>
Commit 53bb7eafb2 ("package/arm-trusted-firmware: add
ARM_TRUSTED_FIRMWARE_CPE_ID_*") added logic to set the cpe-id version from
the package version by dropping a v or lts- prefix, but it used subst
instead of patsubst - So it would replace "v" and "lts-" anywhere in the
version and not only in the beginning of it.
Change to patsubst to fix that.
E.G. with the following defconfig:
BR2_aarch64=y
BR2_TARGET_ARM_TRUSTED_FIRMWARE=y
BR2_TARGET_ARM_TRUSTED_FIRMWARE_CUSTOM_VERSION=y
BR2_TARGET_ARM_TRUSTED_FIRMWARE_CUSTOM_VERSION_VALUE="version-with-v-or-lts-in-it"
before:
make printvars VARS=ARM_TRUSTED_FIRMWARE_CPE_ID_VERSION
ARM_TRUSTED_FIRMWARE_CPE_ID_VERSION=ersion-with--or-in-it
after:
make printvars VARS=ARM_TRUSTED_FIRMWARE_CPE_ID_VERSION
ARM_TRUSTED_FIRMWARE_CPE_ID_VERSION=ersion-with-v-or-lts-in-it
Signed-off-by: Peter Korsgaard <peter@korsgaard.com>
Signed-off-by: Arnout Vandecappelle <arnout@rnout.be>
Building Stellarium includes the download of external tarballs during
configure.
This fails with host-cmake during configure stage:
CMake Error at md4c-subbuild/md4c-populate-prefix/src/md4c-populate-stamp/download-md4c-populate.cmake:163 (message):
Each download failed!
error: downloading 'https://github.com/mity/md4c/archive/refs/tags/release-0.5.2.tar.gz' failed
status_code: 1
status_string: "Unsupported protocol"
log:
--- LOG BEGIN ---
Protocol "https" not supported
closing connection #-1
due to buildroot commit f87138339b which
disabled SSL support for host-cmake.
This patch uses _EXTRA_DOWNLOADS to provide these tarball to allow
offline builds.
No autobuilder error was recorded, the build error can be reproduced
with this defconfig:
BR2_x86_64=y
BR2_x86_corei7=y
BR2_TOOLCHAIN_EXTERNAL=y
BR2_TOOLCHAIN_EXTERNAL_BOOTLIN_X86_64_CORE_I7_GLIBC_BLEEDING_EDGE=y
BR2_FORCE_HOST_BUILD=y
BR2_PACKAGE_STELLARIUM=y
BR2_PACKAGE_MESA3D=y
BR2_PACKAGE_MESA3D_GALLIUM_DRIVER_SOFTPIPE=y
BR2_PACKAGE_MESA3D_OPENGL_GLX=y
BR2_PACKAGE_QT5=y
BR2_PACKAGE_XORG7=y
Signed-off-by: Bernd Kuhls <bernd@kuhls.net>
Signed-off-by: Thomas Petazzoni <thomas.petazzoni@bootlin.com>
We have our own GitLab-CI runner, but with only one we can't run many
jobs in parallel so it takes a very long time before all the tests have
completed. In addition, if that runner goes down, we have nothing at
all.
GitLab offers the following machine types for hosted runners on Linux
x86-64 [1]. The default is the "small" runner. Using a larger runner
increases the "Cost factor" [2].
For opensource projects, the Cost factor is reduced to 0.5 (1 minute per
2 minutes of job time) whatever the runner type.
Runner Tag vCPUs Memory Storage Cost factor (OSS)
saas-linux-small-amd64 (default) 2 8 GB 30 GB 1 (0.5)
saas-linux-medium-amd64 4 16 GB 50 GB 2 (0.5)
saas-linux-large-amd64 (Premium and Ultimate only) 8 32 GB 100 GB 3 (0.5)
saas-linux-xlarge-amd64 (Premium and Ultimate only) 16 64 GB 200 GB 6 (0.5)
saas-linux-2xlarge-amd64 (Premium and Ultimate only) 32 128 GB 200 GB 12 (0.5)
Compute minutes consumed by a job is calculated by:
Job duration / 60 * Cost factor
(Job duration: The time, in seconds, that a job took to run, not
including time spent in the created or pending statuses.)
Thanks to the GitLab OSS program [3], Buildroot benefits from a free
Ultimate subscription and can use GitLab shared runners tagged with
saas-linux-{large, xlarge, 2xlarge}-amd64. In addition, we receive
50,000 free runner minutes per month.
In order to use one of those tags in Buildroot GitLab-CI jobs, we have
to classify all tests by resource requirement, to make sure the job
doesn't fail because it times out or has insufficient memory or disk
space. While we usually shouldn't use the largest runner for
everything, we can use larger runner without cost penalty thanks to
the cost factor reduced to 0.5 for opensource projects. This will
reduce the CI minutes consumed by a CPU intensive job.
First we introduce some new templates used to add the corresponding
runner tag to a runtime test job (reusing the GitLab terminology).
.runner-{small,medium,large,xlarge,2xlarge}
Most of our tests are fast (checkpackage, test_external_bootlin...), so
saas-linux-small-amd64 runner tag is enough. Default to this tag if
nothing else is specified.
Add a comment next to the test class to provide the runner tag.
This runner tag is retrieved when generating the
generated-gitlab-ci.yml file used to create the child pipeline where
the runtime test jobs are executed.
We use the list of runtime tests returned by node2:
"tests.boot.test_edk2.TestEdk2.test_run"
We convert each element of this list to get the path to the test source
file and the name of the test:
"support/testing/tests/boot/test_edk2.py"
TestEdk2
With that, we can grep into the test source file to retrieve the runner
tag placed one line above the test class:
# GitLab-runner: large
class TestEdk2(infra.basetest.BRTest):
Once the runner tag is retrieved, it's used to use the corresponding
runner template to the runtime test job:
tests.boot.test_edk2.TestEdk2.test_run: { extends: [ .runtime_test_base, .runner-large ]}
GitLab runners hosted by the Buildroot project should be able to run
any jobs, so they should be tagged with Gitlab runner tags
(saas-linux-{small,medium,large,xlarge,2xlarge}-amd64).
A specific runner tag "buildroot-runner" can be used to allow running
a job only on such runners.
If a test can't be executed by any shared GitLab-CI runners, we have
to use a runner owned by the Buildroot project. In this case we have
to use a specific template ".runner-buildroot-runner-only" in order to
add the specific runner tag "buildroot-runner" to the job running the
test. There is no such runtime test at the moment.
The proposed classification is based on a previous pipeline analysis
[5]:
- Tests lasting more than 3 hours will use 2xlarge runners.
- Tests lasting more than 2 hours will use xlarge runners.
- Tests lasting more than 1 hours will use large runners.
- Tests building a kernel or a toolchain will use medium runners.
- All other tests will use small runners when possible.
CI minute cost estimate:
tests.package.test_clang.TestClangCompilerRT.test_run lasts 4h25 on the
Buildroot runner. If we this duration for 2xlarge runners, the CI
minute consumed would be:
(15900 / 60) * 0.5 = 133
With 6 jobs using a 2xlarge runners we used ~795 CI minutes.
tests.package.test_kmscube.TestKmsCube.test_run list 2h04 on the
Buildroot runner. If we this duration for xlarge runners, the CI
minute consumed would be:
(7440 / 60) * 0.5 = 62
With 4 jobs using a xlarge runners we used ~248 CI minutes.
tests.package.test_weston.TestWeston.test_run last 1h15 on th
Buildroot runner. If we this duration for large runners, the CI
minute consumed would be:
(4500 / 60) * 0.5 = 37.5
With 28 jobs using a large runners we used ~1050 CI minutes.
tests.package.test_gstreamer1.TestGstreamer1.test_run last 46min on the
Buildroot runner. If we this duration for large runners, the CI
minute consumed would be:
(2760 / 60) * 0.5 = 23
With 31 jobs using a medium runners we used ~713 CI minutes.
tests.package.test_python.TestPython3Py.test_run last 13min on the
Buildroot runner. If we this duration for large runners, the CI
minute consumed would be:
(780 / 60) * 0.5 = 6.5
With 691 jobs using a medium runners we used ~4491 CI minutes.
In total, one pipeline for the runtime tests cost ~7297 CI minutes.
After a first try [6], we are actually using 8000 CI minutes per
pipeline.
We run such pipeline once a week (on Monday), one for each Buildroot
releases every 3 month, one for each stable and LTS release per month,
and one for each release candidate (3).
Worst case (release month):
(4 weeks + 1 release + 1 stable + 1 LTS + 3 release candidate) * 8000 CI
minutes: 80000 CI minutes / 50000.
So we would spend the minutes very quickly in the worst case scenario.
We have to keep one pipeline under 5000 CI minutes.
[1] https://docs.gitlab.com/ci/runners/hosted_runners/linux/#machine-types-available-for-linux---x86-64
[2] https://docs.gitlab.com/ci/pipelines/compute_minutes/#cost-factorshttps://docs.gitlab.com/ci/pipelines/compute_minutes/#compute-usage-calculationhttps://docs.gitlab.com/ci/pipelines/compute_minutes/#cost-factors-of-hosted-runners-for-gitlabcom
[3] https://gitlab.com/buildroot.org/gitlab-oss
[4] https://docs.gitlab.com/ci/runners/hosted_runners/#gitlabcom-hosted-runner-workflow
[5] https://gitlab.com/buildroot.org/buildroot/-/pipelines/2416603721
[6] https://gitlab.com/buildroot.org/buildroot/-/pipelines/2562421098
Signed-off-by: Romain Naour <romain.naour@smile.fr>
[Arnout:
- simplify parsing of test_file and test_name;
- match the entire test_name instead of substring;
- assume "small" by default;
- remove the "small" tags;
- use "gitlab-runner" instead of "Gitlab-runner".
]
Signed-off-by: Arnout Vandecappelle <arnout@rnout.be>
Signed-off-by: Arnout Vandecappelle <arnout@rnout.be>
VERSION should ideally contain only the version, i.e 2.12 and not some
additional prefix like liburing- as it prevents our logic matching
against release-monitoring.org data to work properly.
Fixes: d2ed456532 ("package/liburing: bump to version 2.12")
Signed-off-by: Thomas Petazzoni <thomas.petazzoni@bootlin.com>
Signed-off-by: Marcus Hoffmann <buildroot@bubu1.eu>
Add upstream patch to fix build failure with Linux 6.19.
Upstream: f17facc866
Signed-off-by: Christian Stewart <christian@aperture.us>
[Arnout: update upstream reference to merged commit]
Signed-off-by: Arnout Vandecappelle <arnout@rnout.be>
Commit c53455ea4f ("package/qt5/qt5webengine-chromium: bump version
after qtwebengine bump") bumped qt5webengine-chromium but forgot to
update the licenses.
The diff of the license is reported by
git diff 0ad2814370799a2161057d92231fe3ee00e2fe98..18c9261dc5b8aa57a0bdd5b62ce6f648cca1ef5e -- chromium/third_party/zlib/LICENSE
as the following:
diff --git a/chromium/third_party/zlib/LICENSE b/chromium/third_party/zlib/LICENSE
index 9f056865b57..8aca25d8c7a 100644
--- a/chromium/third_party/zlib/LICENSE
+++ b/chromium/third_party/zlib/LICENSE
@@ -1,6 +1,6 @@
-version 1.2.11, January 15th, 2017
+version 1.2.12, March 27th, 2022
-Copyright (C) 1995-2017 Jean-loup Gailly and Mark Adler
+Copyright (C) 1995-2022 Jean-loup Gailly and Mark Adler
This software is provided 'as-is', without any express or implied
warranty. In no event will the authors be held liable for any damages
so it doesn't change its actual license, let's simply fix the sha256 to
the new value.
Fixes: c53455ea4f ("package/qt5/qt5webengine-chromium: bump version after qtwebengine bump")
Signed-off-by: Quentin Schulz <quentin.schulz@cherry.de>
Signed-off-by: Arnout Vandecappelle <arnout@rnout.be>
If we're adding a dependency to the package, it's for its build system
to use it. Unfortunately, when -feature-system-assimp is not passed, the
assimp module from the sources will be used. Moreover, it doesn't build
currently.
Unfortunately, qt53d still doesn't build with assimp from Buildroot.
Signed-off-by: Quentin Schulz <quentin.schulz@cherry.de>
Signed-off-by: Arnout Vandecappelle <arnout@rnout.be>
If we don't disable it, the assimp module from the sources will be used
instead of none. Unfortunately, it currently doesn't build so let's
disable it when BR2_PACKAGE_ASSIMP is not set such that one can still
build qt53d.
Signed-off-by: Quentin Schulz <quentin.schulz@cherry.de>
Signed-off-by: Arnout Vandecappelle <arnout@rnout.be>
Commit fb53371286 introduced the
python-gymnasium package, but it was not careful enough to propagate
dependencies of selected packages, causing messages such as:
WARNING: unmet direct dependencies detected for BR2_PACKAGE_PYTHON_NUMPY
Depends on [n]: BR2_PACKAGE_PYTHON3 [=y] && BR2_PACKAGE_PYTHON_NUMPY_ARCH_SUPPORTS [=y] && BR2_INSTALL_LIBSTDCPP [=n] && (BR2_TOOLCHAIN_USES_GLIBC [=y] || BR2_TOOLCHAIN_USES_MUSL [=n]) && BR2_TOOLCHAIN_GCC_AT_LEAST_9 [=y]
Selected by [y]:
- BR2_PACKAGE_PYTHON_GYMNASIUM [=y] && BR2_PACKAGE_PYTHON3 [=y]
Signed-off-by: Thomas Petazzoni <thomas.petazzoni@bootlin.com>
Since Buildroot commit dcee99507c in
2025.11-rc1 that bumped package/icu to version 77-1, the build of xerces
with ICU support enabled fails:
In file included from /home/bernd/buildroot/output/host/i586-buildroot-linux-gnu/sysroot/usr/include/unicode/uset.h:38,
from /home/bernd/buildroot/output/build/xerces-3.3.0/src/xercesc/util/regx/RangeToken.cpp:40:
/home/bernd/buildroot/output/host/i586-buildroot-linux-gnu/sysroot/usr/include/unicode/char16ptr.h:271:55:
error: 'is_same_v' is not a member of 'std'; did you mean 'is_same'?
Indeed, ICU now requires C++17. Instead of using a patch from Gentoo[1]
we use a backported upstream commit, limited to CMakeLists.txt, to raise
the c++ version.
The build error was not recorded yet by the autobuilders but can be
reproduced with this defconfig:
BR2_TOOLCHAIN_BUILDROOT_CXX=y
BR2_PACKAGE_XERCES=y
BR2_PACKAGE_ICU=y
[1] https://bugs.gentoo.org/931105
Signed-off-by: Bernd Kuhls <bernd@kuhls.net>
Signed-off-by: Arnout Vandecappelle <arnout@rnout.be>
Buildroot commit 97e2f63bdf bumped
bpftrace from 0.23.3 to 0.24.2.
This release includes upstream commit
7578314df6
which was added to version 0.24.0 and makes use of
bpf_iter_link_info.task that was added to the linux kernel in version
6.1:
f0d74c4da1
causing build errors when the toolchain contains kernel headers version
6.0 because the libbpf package does not update their headers:
output/build/bpftrace-0.24.2/src/attached_probe.cpp: In static member
function 'static bpftrace::Result<std::unique_ptr<bpftrace::AttachedIterProbe> >
bpftrace::AttachedIterProbe::make(bpftrace::Probe&,
const bpftrace::BpfProgram&, std::optional<int>)':
output/build/bpftrace-0.24.2/src/attached_probe.cpp:1437:11: error:
'union bpf_iter_link_info' has no member named 'task'
1437 | linfo.task.pid = *pid;
The build error can be reproduced with this defconfig
BR2_aarch64=y
BR2_KERNEL_HEADERS_VERSION=y
BR2_DEFAULT_KERNEL_VERSION="6.0.19"
BR2_PACKAGE_HOST_LINUX_HEADERS_CUSTOM_6_0=y
BR2_TOOLCHAIN_BUILDROOT_CXX=y
BR2_PER_PACKAGE_DIRECTORIES=y
BR2_PACKAGE_BPFTRACE=y
on the 2026.02.x branch as of 0be927b89a.
Fixes:
https://autobuild.buildroot.net/results/146/14671c54fdf0a2e44bcce7ff61ca9b89a925eca9/
Signed-off-by: Bernd Kuhls <bernd@kuhls.net>
Signed-off-by: Arnout Vandecappelle <arnout@rnout.be>
Buildroot commit 97e2f63bdf in 2026.02-rc1
bumped bpftrace from 0.23.3 to 0.24.2.
This release includes upstream commit
d4f5838227
which was added to version 0.24.0 and makes use of btf_enum64 that was
added to the linux kernel in version 6.0:
6089fb325c
causing build errors when the toolchain contains kernel headers between
versions 5.12 and 5.19 because the libbpf package does not update their
headers so we need to raise the BR2_TOOLCHAIN_HEADERS_AT_LEAST_ version
number again.
The build error can be reproduced with this defconfig
BR2_aarch64=y
BR2_KERNEL_HEADERS_VERSION=y
BR2_DEFAULT_KERNEL_VERSION="5.11.22"
BR2_PACKAGE_HOST_LINUX_HEADERS_CUSTOM_5_11=y
BR2_TOOLCHAIN_BUILDROOT_CXX=y
BR2_PER_PACKAGE_DIRECTORIES=y
BR2_PACKAGE_BPFTRACE=y
on the 2026.02.x branch as of 0be927b89a.
Fixes:
https://autobuild.buildroot.net/results/8f7/8f7ce88a070e825ef178275a13d969349f05593b/
Signed-off-by: Bernd Kuhls <bernd@kuhls.net>
Signed-off-by: Arnout Vandecappelle <arnout@rnout.be>
Buildroot added the bpftrace package in 2024 with commit
338acb27ff
which initially provided version 0.19.1.
This release includes upstream commit
fea3193989
which was added to version 0.17.0 in 2022 and makes use of certain
variables of struct bpf_btf_info which were added to the linux kernel in
2020 with version 5.11:
5329722057
+ __aligned_u64 name;
+ __u32 name_len;
+ __u32 kernel_btf;
The libbpf package updates toolchain headers with its bundled version
only when the toolchain headers are version 5.8 or older, this condition
is part of the initial version of the package added in 2020 with
buildroot commit f7b8508e4f. This version
limit should have been raised when the bpftrace package was added to
avoid build errors when the toolchain contains header versions 5.9 or
5.10.
This situation caused build errors in the autobuilder, the last one in
February 2025:
/home/autobuild/autobuild/instance-18/output-1/build/bpftrace-0.19.1/src/bpffeature.cpp:
In member function 'bool bpftrace::BPFfeature::has_module_btf()':
/home/autobuild/autobuild/instance-18/output-1/build/bpftrace-0.19.1/src/bpffeature.cpp:573:8:
error: 'struct bpf_btf_info' has no member named 'name'
573 | info.name = (__u64)name;
| ^~~~
/home/autobuild/autobuild/instance-18/output-1/build/bpftrace-0.19.1/src/bpffeature.cpp:574:8:
error: 'struct bpf_btf_info' has no member named 'name_len'
574 | info.name_len = sizeof(name);
The problem disappeared from the autobuilders due to newer headers
versions used for the buildroot toolchain or other build errors occurring
earlier, like llvm version mismatches.
The build error can today still be reproduced with this defconfig
BR2_aarch64=y
BR2_KERNEL_HEADERS_5_10=y
BR2_TOOLCHAIN_BUILDROOT_CXX=y
BR2_PER_PACKAGE_DIRECTORIES=y
BR2_PACKAGE_BPFTRACE=y
on the 2026.02.x branch as of 0be927b89a.
To fix the problem we raise the BR2_TOOLCHAIN_HEADERS_AT_LEAST_ version
number.
Fixes:
https://autobuild.buildroot.net/results/dbe/dbecf88c7edba357cee8fea31294ddb9f4d188ad/https://autobuild.buildroot.net/results/df5/df59e038de47f63d14e1be7bd12dd16a69636f79/https://autobuild.buildroot.net/results/359/3595d39dd53a686bbf996dd4e532ced44906b9e3/https://autobuild.buildroot.net/results/e4f/e4f95a5f30a605eadb81802075ea6bb1e2880684/https://autobuild.buildroot.net/results/bd0/bd075cb8c55f9f8a017711dc804b8d81ae89b4c5/
Signed-off-by: Bernd Kuhls <bernd@kuhls.net>
Signed-off-by: Arnout Vandecappelle <arnout@rnout.be>
Buildroot commit f7b8508e4f in 2021.08-rc1
added the libbpf package which contains the usage of the
'install_uapi_headers' make target to update toolchain headers older
than kernel version 5.9. This does not work with per-package
directories.
Building this defconfig that includes all packages depending on libbpf:
BR2_x86_64=y
BR2_x86_rocketlake=y
BR2_KERNEL_HEADERS_VERSION=y
BR2_DEFAULT_KERNEL_VERSION="5.8.18"
BR2_PACKAGE_HOST_LINUX_HEADERS_CUSTOM_5_8=y
BR2_TOOLCHAIN_BUILDROOT_CXX=y
BR2_PER_PACKAGE_DIRECTORIES=y
BR2_PACKAGE_BPFTRACE=y
BR2_PACKAGE_DPDK=y
BR2_PACKAGE_IPROUTE2=y
BR2_PACKAGE_HOST_PAHOLE=y
on the 2026.02.x branch as of 0be927b89a
is broken:
output/build/bpftrace-0.24.2/src/attached_probe.cpp: In static member
function 'static bpftrace::Result<std::unique_ptr<bpftrace::AttachedIterProbe> >
bpftrace::AttachedIterProbe::make(bpftrace::Probe&,
const bpftrace::BpfProgram&, std::optional<int>)':
output/build/bpftrace-0.24.2/src/attached_probe.cpp:1435:30: error:
aggregate 'bpf_iter_link_info linfo' has incomplete type and cannot be
defined
1435 | union bpf_iter_link_info linfo;
libbpf overwrites kernel header files installed in $STAGING_DIR when
they are too old by adding 'install_uapi_headers' as make target. In
the case of per-package directories these header files are stored only
in output/per-package/libbpf/.
When output/per-package/bpftrace/ is populated, the content of
output/per-package/ from other packages overwrites the header files
installed by libbpf because the list of rsync'ed packages is sorted
alphabetically:
https://gitlab.com/buildroot.org/buildroot/-/blob/2026.02.1/package/pkg-generic.mk#L796
To prevent this problem let libbpf install the updated kernel headers in
a new directory.
Other packages need to find this directory. This mostly happens through
pkg-config, but bpftrace doesn't use that:
https://github.com/bpftrace/bpftrace/blob/v0.25.1/cmake/FindLibBpf.cmake#L9
Therefore, use a configure option in bpftrace to set the correct path.
Please note that libbpf will add '/linux' to the path provided in
$UAPIDIR:
https://github.com/libbpf/libbpf/blob/v1.7.0/src/Makefile#L169
so the headers end up in the previously non-existing directory
$(STAGING_DIR)/usr/include/bpf/linux/:
$ find output/per-package/libbpf/host/x86_64-buildroot-linux-gnu/sysroot/ -iname bpf.h -exec ls -lao {} \;
-rw-r--r-- 1 bernd 26434 25. Apr 13:15 output/per-package/libbpf/host/x86_64-buildroot-linux-gnu/sysroot/usr/include/bpf/bpf.h
-rw-r--r-- 1 bernd 283012 25. Apr 13:15 output/per-package/libbpf/host/x86_64-buildroot-linux-gnu/sysroot/usr/include/bpf/linux/bpf.h
-rw-r--r-- 12 bernd 160166 25. Apr 13:08 output/per-package/libbpf/host/x86_64-buildroot-linux-gnu/sysroot/usr/include/linux/bpf.h
bpf.h with 283012 bytes is the update-to-date version needed for bpftrace:
$ grep -m1 bpf_iter_link_info output/per-package/libbpf/host/x86_64-buildroot-linux-gnu/sysroot/usr/include/bpf/linux/bpf.h
union bpf_iter_link_info {
$
$ grep -m1 bpf_iter_link_info output/per-package/libbpf/host/x86_64-buildroot-linux-gnu/sysroot/usr/include/linux/bpf.h
$
By adding '-I$(STAGING_DIR)/usr/include/bpf' to the CXXFLAGS of bpftrace
its include finds the correct header:
https://github.com/bpftrace/bpftrace/blob/v0.25.1/src/bpfprogram.cpp#L3
#include <linux/bpf.h>
The dpdk package uses pkg-config` to detect libbpf and will use the updated
.pc file:
https://github.com/DPDK/dpdk/blob/v25.11/drivers/net/tap/bpf/meson.build#L7
The iproute2 package is not affected by the problem because it contains
"matching sanitized kernel headers":
https://git.kernel.org/pub/scm/network/iproute2/iproute2.git/tree/README?h=v6.17.0#n44
As a host package pahole is also not affected.
Fixes:
https://autobuild.buildroot.net/results/d8b/d8b416e40bf7bd019cd93e6f2d42c98fc12d4160/
Signed-off-by: Bernd Kuhls <bernd@kuhls.net>
Signed-off-by: Arnout Vandecappelle <arnout@rnout.be>
Buildroot commit 97e2f63bdf in 2026.02-rc1
bumped the package to 0.24.2 but forgot to remove the configure option
INSTALL_TOOL_DOCS which was removed upstream in version 0.24.0:
579e0e9dfe
Signed-off-by: Bernd Kuhls <bernd@kuhls.net>
Signed-off-by: Arnout Vandecappelle <arnout@rnout.be>
Buildroot commit 305c40613c in 2025.08-rc1
bumped the package to 0.23.3 but forgot to remove the configure option
USE_SYSTEM_BPF_BCC which was removed upstream in version 0.20.0:
ef6d9d42d3
Signed-off-by: Bernd Kuhls <bernd@kuhls.net>
Signed-off-by: Arnout Vandecappelle <arnout@rnout.be>
Since last commit, utils/generate-cyclonedx can now be used with
Buildroot host tools, provided the user either externally install the
SPDX schema in the DL_DIR themselves or have
BR2_PACKAGE_HOST_PYTHON3_SSL and BR2_PACKAGE_HOST_CA_CERTIFICATES both
enabled. If the latter is missing, Python will complain with:
Traceback (most recent call last):
File "/buildroot/build/host/lib/python3.14/urllib/request.py", line 1321, in do_open
h.request(req.get_method(), req.selector, req.data, headers,
~~~~~~~~~^^^^^^^^^^^^^^^^^^^^^^^^^^^^^^^^^^^^^^^^^^^^^^^^^^^
encode_chunked=req.has_header('Transfer-encoding'))
^^^^^^^^^^^^^^^^^^^^^^^^^^^^^^^^^^^^^^^^^^^^^^^^^^^
File "/buildroot/build/host/lib/python3.14/http/client.py", line 1358, in request
self._send_request(method, url, body, headers, encode_chunked)
~~~~~~~~~~~~~~~~~~^^^^^^^^^^^^^^^^^^^^^^^^^^^^^^^^^^^^^^^^^^^^
File "/buildroot/build/host/lib/python3.14/http/client.py", line 1404, in _send_request
self.endheaders(body, encode_chunked=encode_chunked)
~~~~~~~~~~~~~~~^^^^^^^^^^^^^^^^^^^^^^^^^^^^^^^^^^^^^
File "/buildroot/build/host/lib/python3.14/http/client.py", line 1353, in endheaders
self._send_output(message_body, encode_chunked=encode_chunked)
~~~~~~~~~~~~~~~~~^^^^^^^^^^^^^^^^^^^^^^^^^^^^^^^^^^^^^^^^^^^^^
File "/buildroot/build/host/lib/python3.14/http/client.py", line 1113, in _send_output
self.send(msg)
~~~~~~~~~^^^^^
File "/buildroot/build/host/lib/python3.14/http/client.py", line 1057, in send
self.connect()
~~~~~~~~~~~~^^
File "/buildroot/build/host/lib/python3.14/http/client.py", line 1499, in connect
self.sock = self._context.wrap_socket(self.sock,
~~~~~~~~~~~~~~~~~~~~~~~~~^^^^^^^^^^^
server_hostname=server_hostname)
^^^^^^^^^^^^^^^^^^^^^^^^^^^^^^^^
File "/buildroot/build/host/lib/python3.14/ssl.py", line 455, in wrap_socket
return self.sslsocket_class._create(
~~~~~~~~~~~~~~~~~~~~~~~~~~~~^
sock=sock,
^^^^^^^^^^
...<5 lines>...
session=session
^^^^^^^^^^^^^^^
)
^
File "/buildroot/build/host/lib/python3.14/ssl.py", line 1076, in _create
self.do_handshake()
~~~~~~~~~~~~~~~~~^^
File "/buildroot/build/host/lib/python3.14/ssl.py", line 1372, in do_handshake
self._sslobj.do_handshake()
~~~~~~~~~~~~~~~~~~~~~~~~~^^
ssl.SSLCertVerificationError: [SSL: CERTIFICATE_VERIFY_FAILED] certificate verify failed: unable to get local issuer certificate (_ssl.c:1081)
During handling of the above exception, another exception occurred:
Traceback (most recent call last):
File "/buildroot/utils/generate-cyclonedx", line 53, in <module>
urllib.request.urlretrieve(SPDX_SCHEMA_URL, SPDX_SCHEMA_PATH)
~~~~~~~~~~~~~~~~~~~~~~~~~~^^^^^^^^^^^^^^^^^^^^^^^^^^^^^^^^^^^
File "/buildroot/build/host/lib/python3.14/urllib/request.py", line 212, in urlretrieve
with contextlib.closing(urlopen(url, data)) as fp:
~~~~~~~^^^^^^^^^^^
File "/buildroot/build/host/lib/python3.14/urllib/request.py", line 187, in urlopen
return opener.open(url, data, timeout)
~~~~~~~~~~~^^^^^^^^^^^^^^^^^^^^
File "/buildroot/build/host/lib/python3.14/urllib/request.py", line 487, in open
response = self._open(req, data)
File "/buildroot/build/host/lib/python3.14/urllib/request.py", line 504, in _open
result = self._call_chain(self.handle_open, protocol, protocol +
'_open', req)
File "/buildroot/build/host/lib/python3.14/urllib/request.py", line 464, in _call_chain
result = func(*args)
File "/buildroot/build/host/lib/python3.14/urllib/request.py", line 1369, in https_open
return self.do_open(http.client.HTTPSConnection, req,
~~~~~~~~~~~~^^^^^^^^^^^^^^^^^^^^^^^^^^^^^^^^^^
context=self._context)
^^^^^^^^^^^^^^^^^^^^^^
File "/buildroot/build/host/lib/python3.14/urllib/request.py", line 1324, in do_open
raise URLError(err)
urllib.error.URLError: <urlopen error [SSL: CERTIFICATE_VERIFY_FAILED] certificate verify failed: unable to get local issuer certificate (_ssl.c:1081)>
Provide some hint as to what could be missing from Buildroot host.
Signed-off-by: Quentin Schulz <quentin.schulz@cherry.de>
Signed-off-by: Arnout Vandecappelle <arnout@rnout.be>
The host ca-certificates is needed to download the SPDX schema on
CycloneDX's GitHub when using Buildroot's host Python, see
urllib.request.urlretrieve(SPDX_SCHEMA_URL, SPDX_SCHEMA_PATH) in
utils/generate-cyclonedx.
Note that unlike the target package which uses a _TARGET_FINALIZE_HOOKS
since commit 2bc8e72baf ("package/ca-certificates: create the bundle
as target-finalize hook"), the host package doesn't have this option as
there's no such hook for host packages. Therefore, the target's
CA_CERTIFICATES_INSTALL_TARGET_CMDS and CA_CERTIFICATES_GEN_BUNDLE are
merged and adapted into HOST_CA_CERTIFICATES_INSTALL_CMDS.
This of course has the same shortcomings as the target package had
before commit 2bc8e72baf ("package/ca-certificates: create the bundle
as target-finalize hook").
The adaptations were:
- replaced $(TARGET_MAKE_ENV) with $(HOST_MAKE_ENV)
- replaced $(TARGET_DIR) to $(HOST_DIR)
- replaced $(HOST_DIR)/usr with $(HOST_DIR)
- replaced find usr/share/ca-certificates with find share/ca-certificates
(since it's done from within $(HOST_DIR)
Signed-off-by: Quentin Schulz <quentin.schulz@cherry.de>
Signed-off-by: Arnout Vandecappelle <arnout@rnout.be>
urllib will eventually complain that it does not know what https is:
Traceback (most recent call last):
File "/buildroot/utils/generate-cyclonedx", line 53, in <module>
urllib.request.urlretrieve(SPDX_SCHEMA_URL, SPDX_SCHEMA_PATH)
~~~~~~~~~~~~~~~~~~~~~~~~~~^^^^^^^^^^^^^^^^^^^^^^^^^^^^^^^^^^^
File "/buildroot/build/host/lib/python3.14/urllib/request.py", line 212, in urlretrieve
with contextlib.closing(urlopen(url, data)) as fp:
~~~~~~~^^^^^^^^^^^
File "/buildroot/build/host/lib/python3.14/urllib/request.py", line 187, in urlopen
return opener.open(url, data, timeout)
~~~~~~~~~~~^^^^^^^^^^^^^^^^^^^^
File "/buildroot/build/host/lib/python3.14/urllib/request.py", line 487, in open
response = self._open(req, data)
File "/buildroot/build/host/lib/python3.14/urllib/request.py", line 509, in _open
return self._call_chain(self.handle_open, 'unknown',
~~~~~~~~~~~~~~~~^^^^^^^^^^^^^^^^^^^^^^^^^^^^^
'unknown_open', req)
^^^^^^^^^^^^^^^^^^^^
File "/buildroot/build/host/lib/python3.14/urllib/request.py", line 464, in _call_chain
result = func(*args)
File "/buildroot/build/host/lib/python3.14/urllib/request.py", line 1397, in unknown_open
raise URLError('unknown url type: %s' % type)
urllib.error.URLError: <urlopen error unknown url type: https>
It's quite confusing really but what it means is that host Python was
built without ssl support.
This adds an additional check importing _ssl and if the module is not
found, tell the user what to do. This still doesn't make Buildroot's
host Python3 fully usable for utils/generate-cyclonedx as it'll then
fail when trying to validate certificates, this will be handled in the
next few commits.
Note that ssl Python library is always built in CPython, but itself
imports the _ssl module which is the one that may be disabled with
py_cv_module__ssl=n/a (which is what happens when
BR2_PACKAGE_HOST_PYTHON3_SSL is not enabled), hence why _ssl is checked
and not ssl.
Signed-off-by: Quentin Schulz <quentin.schulz@cherry.de>
Signed-off-by: Arnout Vandecappelle <arnout@rnout.be>
Buildroot-local patches can only be suffixed by .patch, otherwise they
either need to be downloaded via <PKG>_PATCH or manually applied via
$(APPLY_PATCHES) in a <PKG>_{PRE,POST}_PATCH_HOOKS like in
linux/linux.mk. In the former case, they are then listed in the
show-info output with a full URL (prefixed by '<PKG>_SITE_METHOD+'). In
the latter case, they not listed as patches at the moment, just as
externalReferences.
By removing "support" for those compressed patches, we can avoid the bz2
dependency and can now use Buildroot's host-python3 package without
BR2_PACKAGE_HOST_PYTHON3_BZIP2 to run utils/generate-cyclonedx.
Signed-off-by: Quentin Schulz <quentin.schulz@cherry.de>
Signed-off-by: Arnout Vandecappelle <arnout@rnout.be>
Some packages do not have a http/https download URL for a source tarball,
but are acquired over a version control system like git. If so, add
externalReferences of type "vcs" for such URLs.
As most git repositories use a https:// transport that may not indicated the
repository type, add a "comment" due to the lack of a better mechanism in
CycloneDX.
While the hashes are calculated over a tarball created locally, it still may
be useful, so add them for "vcs" externalReferences as well.
Signed-off-by: Martin Willi <martin@strongswan.org>
Acked-By: Thomas Perale <thomas.perale@mind.be>
Signed-off-by: Arnout Vandecappelle <arnout@rnout.be>
Finding the hash file for a package is non-trivial, as they can be in a
<version> sub-directory or under GLOBAL_PATCH_DIR. To allow other tools
such as utils/generate-cyclonedx to find hash files, expose this information
from show-info. If a package does not provide a hash file, create an
empty hashes array.
Suggested-by: Thomas Perale <thomas.perale@mind.be>
Signed-off-by: Martin Willi <martin@strongswan.org>
Signed-off-by: Arnout Vandecappelle <arnout@rnout.be>
Commit dc4af8bfa9 ("utils/generate-cyclonedx: use direct dependencies")
removes indirect dependencies from any listed component, as required by
CycloneDX. The root component, however, still includes indirect dependencies,
as it just takes the components from the show-info output.
Fix this by collecting all component dependencies, and then filter the root
component dependencies to include direct dependencies only.
Signed-off-by: Martin Willi <martin@strongswan.org>
Acked-By: Thomas Perale <thomas.perale@mind.be>
Signed-off-by: Arnout Vandecappelle <arnout@rnout.be>
Commit dd4161c39d ("package/util-linux:
optionally add libpthread to uuid.pc") added patches to util-linux and
util-linux-libs that require autoreconf, but forgot to add autoreconf
for util-linux-libs, which this new commit fixes.
Signed-off-by: Thomas Petazzoni <thomas.petazzoni@bootlin.com>
Fixes wayland-related build error:
make[4]: *** No rule to make target '/usr/share/waylandpp/protocols/presentation-time.xml',
needed by 'wayland-extra-protocols.hpp'. Stop.
by adding a configure parameter pointing to STAGING_DIR.
The build error was not recorded by the autobuilders and can be
reproduced by this defconfig:
BR2_x86_64=y
BR2_TOOLCHAIN_EXTERNAL=y
BR2_PER_PACKAGE_DIRECTORIES=y
BR2_ROOTFS_DEVICE_CREATION_DYNAMIC_EUDEV=y
BR2_PACKAGE_KODI=y
BR2_PACKAGE_MESA3D=y
BR2_PACKAGE_MESA3D_GALLIUM_DRIVER_SOFTPIPE=y
BR2_PACKAGE_MESA3D_OPENGL_EGL=y
BR2_PACKAGE_MESA3D_OPENGL_ES=y
BR2_PACKAGE_PYTHON3=y
BR2_PACKAGE_PYTHON3_PY_ONLY=y
BR2_PACKAGE_WAYLAND=y
LibreELEC added this configure parameter seven years ago:
d19ab98bf3
so a backport to LTS branches should be considered.
Signed-off-by: Bernd Kuhls <bernd@kuhls.net>
Signed-off-by: Arnout Vandecappelle <arnout@rnout.be>
Buildroot commit a3374e49ba in 2026.05-rc1
bumped the package from 6.0.20 to 8.0.4.
Upstream included in version 8.0.1 a commit adding rustdoc as build
dependency "required for the tests":
6d74656bef
This causes an error during configure in buildroot:
checking for rustdoc... no
configure: error: rustdoc required
To fix we problem we add RUSTDOC=true to _CONV_ENV.
Fixes:
https://autobuild.buildroot.net/results/489/48984ab369d01fae9b53b7b1f51e874bada0619f/
Signed-off-by: Bernd Kuhls <bernd@kuhls.net>
Signed-off-by: Arnout Vandecappelle <arnout@rnout.be>
Commit 5bf0db998b ("package/icu: bump version to 78.1") dropped the
dash-to-dot conversion logic as upstream now uses dots in the tags names
(E.G. release-78.1), but forgot to drop the comment explaining why we were
doing the conversion - So drop the now outdated comment.
Signed-off-by: Peter Korsgaard <peter@korsgaard.com>
Signed-off-by: Arnout Vandecappelle <arnout@rnout.be>
Reported via IRC in #buildroot connmanctl segfaults randomly
on startup and keyboard input is not echoed back.
Could be reproduced with Raspberry PI4 (32 Bit) defconfig and glibc
based userland.
Signed-off-by: Waldemar Brodkorb <wbx@openadk.org>
Signed-off-by: Arnout Vandecappelle <arnout@rnout.be>
https://github.com/Netatalk/netatalk/blob/netatalk-4-4-3/NEWS.md
The bump from 4.4.2 to 4.4.3 fixes these CVEs:
CVE-2026-44047, CVE-2026-44048, CVE-2026-44049, CVE-2026-44050,
CVE-2026-44051, CVE-2026-44052, CVE-2026-44054, CVE-2026-44055,
CVE-2026-44057, CVE-2026-44060, CVE-2026-44062, CVE-2026-44064,
CVE-2026-44066, CVE-2026-44068, CVE-2026-44076, CVE-2026-45354,
CVE-2026-45355, CVE-2026-45356, CVE-2026-45698, CVE-2026-45699
Version 3.2.8 fixes these CVEs:
CVE-2024-1544, CVE-2024-5288, CVE-2024-5991, CVE-2024-5814
Version 3.2.1 fixes these CVEs:
CVE-2024-38439, CVE-2024-38440, CVE-2024-38441
Updated project URL in Config.in help text.
Removed md5 tarball hash and added sha256 and sha512 tarball hashes
provided by upstream.
Updated license hash due to upstream commits:
06e427ea02934495d9e1
Switched _SITE to https.
Version 4.0.0 removed autotools and kept only meson as build system.
Reworked dependencies, sorted NETATALK_DEPENDENCIES.
Iniparser was added as mandatory dependency in 4.2.0.
Added optional dependencies to cracklib and openldap.
Disabled usage of libiconv for uClibc due to different definitions of
iconv_t (uClibc: typedef long vs. glibc: typedef void) which causes
a build error after the switch to meson.
Signed-off-by: Bernd Kuhls <bernd@kuhls.net>
Signed-off-by: Arnout Vandecappelle <arnout@rnout.be>
When running 'make show-info-all' without a '.config', it is possible to
trigger this script without passing a version number.
The 'show-info-all' target is special because it forces the reading of
all packages without requiring a .config, so BR2_HOST_CMAKE_AT_LEAST is
unset and the script is called as:
check-host-cmake.sh cmake cmake3
Without validation, the integer comparisons below would produce errors
like:
check-host-cmake.sh: line 37: [: cmake: integer expected
It's possible to trigger this by adding the following file somewhere in
you path:
cat >/bin/cmake3 <<EOF
echo "cmake version 4.3.3 CMake suite maintained and supported by Kitware (kitware.com/cmake)."
EOF
make show-info-all
The same issue can also occur with pkg-stats.
Signed-off-by: Thomas Perale <thomas.perale@mind.be>
Signed-off-by: Arnout Vandecappelle <arnout@rnout.be>
The maintenance and testing workflow sometimes requires to output a
list of every existing package on Buildroot:
- Generating an SBOM of the whole Buildroot tree, e.g. `for
security.buildroot.org
- List every source for every package, e.g. for sources.buildroot.net
The previous solution relied on `make allyesconfig` but always ran into
conflicts that needed manual resolution. Also some packages would not be
present because they are architecture dependent.
To avoid having to manually modify the 'show-info' command this commit
adds the 'show-info-all' command. It accesses the PACKAGES_ALL variable
with all the packages present in Buildroot independently of the
architecture or any config entries.
It forces the `BR2_HAVE_DOT_CONFIG` variable to be set to force the
reading of the package mk files.
It is also added to noconfig_targets, to avoid the .config influencing
the output of show-info-all.
Note that this is not yet a complete solution - it doesn't take into
account the multiple versions that are possible for some packages like
GCC. Also for e.g. linux or uboot the version is empty and the URL is
invalid.
Signed-off-by: Thomas Perale <thomas.perale@mind.be>
[Arnout: refactor with existing show-info]
Signed-off-by: Arnout Vandecappelle <arnout@rnout.be>
https://www.busybox.net/news.html
Removed patches which are included in this release, renumbered remaining
patches.
Patch 0006 was removed because its fix is included in upstream commit
9a8796436b
which also adds a new Kconfig option, disabled by default, to fix
CVE-2023-39810. To improve security we enable this option by default.
Signed-off-by: Bernd Kuhls <bernd@kuhls.net>
Signed-off-by: Peter Korsgaard <peter@korsgaard.com>
Since Buildroot commit 0e3ddc9dc8,
linux hash files are split between pre- and post-6.17.
Since that commit, the script that automatically updates kernel
versions in Buildroot was broken, as it assumed only a single linux
hash file at a static location. Update the script to find all relevant
files, even if a new split occurs in the future.
In addition, this patch carries additional minor changes:
- Fix some minor shellcheck issues found with a newer shellcheck version
than in the container (quoting, test -a -> -e)
- Move from wget to curl, as I had some issue on my home connection
with the former (possibly ipv6 related or something)
Signed-off-by: Titouan Christophe <titouan.christophe@mind.be>
Signed-off-by: Arnout Vandecappelle <arnout@rnout.be>
uutils install 0.8.0 as used in Ubuntu 26.04 has a bug in the install
applet, breaking a number of packages:
https://github.com/uutils/coreutils/pull/11505https://bugs.launchpad.net/ubuntu/+source/rust-coreutils/+bug/2151454
The fix has been merged upstream but not yet released or packaged in Ubuntu,
so detect and reject the buggy version and explain how to change to the
coreutils version. Once fixed the version output will hopefully change.
For simplicity, only check for the exact 0.8.0 version string. Hopefully
when it is fixed in Ubuntu, they also update the version string. Note
that earlier versions of uutils have the same issue of course, but those
versions were never the default "install" on Ubuntu (or anywhere else).
Signed-off-by: Peter Korsgaard <peter@korsgaard.com>
Signed-off-by: Arnout Vandecappelle <arnout@rnout.be>
This reverts commit 6b56e0b4f0.
commit 6b56e0b4f0 ("linux: disable -Werror") said we needed to disable
CONFIG_WERROR in the kernel because it failed to build the esp-hosted
kernel module. This was very much the hammer approach because a) it'd be
better to fix the warnings in the kernel module or b) disable the
kernel's CONFIG_WERROR *only* if esp-hosted is to be built, via the
ESP_HOSTED_LINUX_CONFIG_FIXUPS variable in
package/esp-hosted/esp-hosted.mk.
This is a simple revert without making any change to any kernel module
(including esp-hosted) because all upstream Buildroot defconfigs with a
kernel module enabled build fine today (albeit with warnings). The two
defconfigs that were pointed at by the now-reverted commit all have been
(updated for and) run on master without failing the build.
Suggested-by: Arnout Vandecappelle <arnout@rnout.be>
Signed-off-by: Quentin Schulz <quentin.schulz@cherry.de>
Signed-off-by: Arnout Vandecappelle <arnout@rnout.be>
As of today, the Buildroot project is now 100% compliant with
OpenSSF Best Practices self-assesment. Let's therefore advertise this
in our SECURITY.md and in the footer of the website.
Signed-off-by: Titouan Christophe <titouan.christophe@mind.be>
Signed-off-by: Peter Korsgaard <peter@korsgaard.com>
Detected by Gitlab pipeline when testing the other build fixes in this
series. Autobuilders did not detect the problem due to the build error
with glibc 2.43.
https://gitlab.com/bkuhls/buildroot/-/jobs/14571737512
/builds/bkuhls/buildroot/br-test-pkg/bootlin-powerpc-e500mc-uclibc/build/odhcp6c-f19dd37fb467c9cf10cad57aefa0d048312d7dfd/src/dhcpv6.c:1395:58:
error: comparison of integer expressions of different signedness:
‘uint32_t’ {aka ‘unsigned int’} and ‘int’ [-Werror=sign-compare]
1395 | if (ia_hdr->iaid != htonl(ifindex) && otype == DHCPV6_OPT_IA_NA)
https://gitlab.com/bkuhls/buildroot/-/jobs/14571737510
/builds/bkuhls/buildroot/br-test-pkg/bootlin-openrisc-uclibc/build/odhcp6c-f19dd37fb467c9cf10cad57aefa0d048312d7dfd/src/dhcpv6.c:1395:58:
error: comparison of integer expressions of different signedness:
‘uint32_t’ {aka ‘unsigned int’} and ‘int’ [-Werror=sign-compare]
https://gitlab.com/bkuhls/buildroot/-/jobs/14571737505
/builds/bkuhls/buildroot/br-test-pkg/bootlin-m68k-68040-uclibc/build/odhcp6c-f19dd37fb467c9cf10cad57aefa0d048312d7dfd/src/dhcpv6.c:1395:58:
error: comparison of integer expressions of different signedness:
‘uint32_t’ {aka ‘unsigned int’} and ‘int’ [-Werror=sign-compare]
Signed-off-by: Bernd Kuhls <bernd@kuhls.net>
Signed-off-by: Arnout Vandecappelle <arnout@rnout.be>
Fixes build errors seen with Gitlab pipeline and this defconfig:
support/config-fragments/autobuild/bootlin-aarch64-glibc-old.config
https://gitlab.com/bkuhls/buildroot/-/jobs/14570080455
aarch64-linux-gcc.br_real: error: unrecognized command line option
‘-Wimplicit-fallthrough=5’; did you mean ‘-Wno-fallthrough’?
aarch64-linux-gcc.br_real: error: unrecognized command line option
‘-Wshadow=local’; did you mean ‘-Wshadow-ivar’?
Removing all the unrecognized command line options from CMakeLists.txt
showed more build errors during compile:
output/build/odhcp6c-24485bb4b35ab84c17c2e87bd561d026d4c15c00/src/odhcp6c.h:47:46:
error: expected ‘)’ before ‘__VA_OPT__’
#define error(fmt, ...) __iflog(LOG_ERR, fmt __VA_OPT__(, ) __VA_ARGS__)
Another pipeline with gcc 9 showed other errors:
https://gitlab.com/bkuhls/buildroot/-/jobs/14570080479
/builds/bkuhls/buildroot/br-test-pkg/br-arm-basic/build/odhcp6c-24485bb4b35ab84c17c2e87bd561d026d4c15c00/src/dhcpv6.c:1126:4:
error: a label can only be part of a statement and a declaration is not a statement
1126 | struct dhcpv6_auth *r = (void*)&odata[-DHCPV6_OPT_HDR_SIZE];
so we raise the minimum gcc version to 10.
Signed-off-by: Bernd Kuhls <bernd@kuhls.net>
Signed-off-by: Arnout Vandecappelle <arnout@rnout.be>
Buildroot commit ce5d173571 removed
0001-fix-build-with-gcc-14.patch which the version bump to 1.4.3.
The patch originally not only fixed share/utf8.c but also
ogginfo/codec_skeleton.c. Upstream only applied the fix for
ogginfo/codec_skeleton.c:
68c5a33685
so the build still fails:
utf8.c: In function 'convert_buffer':
utf8.c:271:9: error: implicit declaration of function 'charset_convert'
[-Wimplicit-function-declaration]
271 | ret = charset_convert(fromcode, tocode, from, fromlen, to, tolen);
Added upstream commit to fix the problem.
Fixes:
https://autobuild.buildroot.net/results/135/13520e3cbf6b6d169985f4d1378c2a1baab852e0/
The build error can be reproduced by this minimal defconfig:
BR2_TOOLCHAIN_BUILDROOT_UCLIBC=y
BR2_PACKAGE_VORBIS_TOOLS=y
Signed-off-by: Bernd Kuhls <bernd@kuhls.net>
Signed-off-by: Arnout Vandecappelle <arnout@rnout.be>
Buildroot commit e1050a3a50 bumped the
package which includes upstream commit
https://git.openwrt.org/?p=project/ustream-ssl.git;a=commit;h=956fba242ac0a4bcfe3db103d4d1f41545c924fb
that adds the usage of SSL_trace causing a build error when OpenSSL was
built without ssl-trace support:
/home/autobuild/autobuild/instance-10/output-1/build/ustream-ssl-5a81c108d20e24724ed847cc4be033f2a74e6635/ustream-openssl.c:
In function '__ustream_ssl_set_debug':
/home/autobuild/autobuild/instance-10/output-1/build/ustream-ssl-5a81c108d20e24724ed847cc4be033f2a74e6635/ustream-openssl.c:490:44:
error: 'SSL_trace' undeclared (first use in this function); did you mean 'SSL_write'?
490 | SSL_CTX_set_msg_callback(ctx->ssl, SSL_trace);
Fixes:
https://autobuild.buildroot.net/results/17c/17c88282c32f2edfa0991e0e10cb45013c947be9/
Signed-off-by: Bernd Kuhls <bernd@kuhls.net>
Signed-off-by: Arnout Vandecappelle <arnout@rnout.be>
Buildroot commit c7a1b73f17 removed
patches 0001-ecore_evas-engines-drm-meson.build-use-gl_deps-as-en.patch
and 0002-ecore_evas-engines-drm-meson.build-fix-gl_drm-includ.patch.
This defconfig
BR2_x86_64=y
BR2_TOOLCHAIN_EXTERNAL=y
BR2_ROOTFS_DEVICE_CREATION_DYNAMIC_EUDEV=y
BR2_PACKAGE_EFL=y
BR2_PACKAGE_EFL_DRM=y
BR2_PACKAGE_MESA3D=y
BR2_PACKAGE_MESA3D_GALLIUM_DRIVER_SOFTPIPE=y
BR2_PACKAGE_MESA3D_OPENGL_GLX=y
BR2_PACKAGE_MESA3D_OPENGL_EGL=y
BR2_PACKAGE_MESA3D_OPENGL_ES=y
BR2_PACKAGE_XORG7=y
BR2_PACKAGE_LUAJIT=y
is broken now during configure stage
output/build/efl-1.28.1/src/modules/ecore_evas/engines/drm/meson.build:6:18:
ERROR: Unknown variable "engine_gl_drm".
which is fixed by former patch 0001.
Later a build error occurs which is fixed by former patch 0002.
The error was not yet caught by the autobuilders.
Signed-off-by: Bernd Kuhls <bernd@kuhls.net>
Signed-off-by: Arnout Vandecappelle <arnout@rnout.be>
The tags specified by a job are ANDed, not ORed. So with
.runner-small:
tags:
- buildroot-runner
- saas-linux-small-amd64
the job will only run on a runner that has _both_ tags - so only on the
buildroot runner. That makes it pretty pointless.
Remove all the buildroot-runner tags, except in the
.runner-buildroot-runner-only template.
Signed-off-by: Arnout Vandecappelle <arnout@rnout.be>
Currently the weekly pipelines are triggered from a cron job on the
Buildroot server, so generate-gitlab-ci-yml filters on the "trigger"
source. However, we'd like to schedule it on gitlab itself, which makes
managing it easier.
We could filter on "schedule" in addition to "trigger", but there's not
really a reason to. We can simply rely on the BR_SCHEDULE_JOBS variable
- if it is set, we use its information.
Signed-off-by: Arnout Vandecappelle <arnout@rnout.be>
We have our own GitLab-CI runner, but with only one we can't run many
jobs in parallel so it takes a very long time before all the tests have
completed. In addition, if that runner goes down, we have nothing at
all.
GitLab offers the following machine types for hosted runners on Linux
x86-64 [1]. The default is the "small" runner. Using a larger runner
increases the "Cost factor" [2]:
Runner Tag vCPUs Memory Storage Cost factor
saas-linux-small-amd64 (default) 2 8 GB 30 GB 1
saas-linux-medium-amd64 4 16 GB 50 GB 2
saas-linux-large-amd64 (Premium and Ultimate only) 8 32 GB 100 GB 3
saas-linux-xlarge-amd64 (Premium and Ultimate only) 16 64 GB 200 GB 6
saas-linux-2xlarge-amd64 (Premium and Ultimate only) 32 128 GB 200 GB 12
Compute minutes consumed by a job is calculated by:
Job duration / 60 * Cost factor
(Job duration: The time, in seconds, that a job took to run, not
including time spent in the created or pending statuses.)
Thanks to the GitLab OSS program [3], Buildroot benefits from a free
Ultimate subscription and can use GitLab shared runners tagged with
saas-linux-{large, xlarge, 2xlarge}-amd64. In addition, we receive
50,000 free runner minutes per month.
For opensource projects, the Cost factor is reduced by 0,5 (1 minute per
2 minutes of job time).
In order to use one of those tags in Buildroot GitLab-CI jobs, we have
to classify all tests by resource requirement, to make sure the job
doesn't fail because it times out or has insufficient memory or disk
space. We also don't want to use the largest runner for everything
because that would spend the minutes very quickly while the resources
aren't used efficiently (mostly serialized).
First we introduce some new templates used to add the corresponding
runner tag to a runtime test job (reusing the GitLab terminology).
.runner-{small,medium,large,xlarge,2xlarge}
Most of our tests are fast (checkpackage, test_external_bootlin...), so
saas-linux-small-amd64 runner tag is enough. Default to this tag if
nothing else is specified.
Add a comment next to the test class to provide the runner tag.
This runner tag is retrieved when generating the
generated-gitlab-ci.yml file used to create the child pipeline where
the runtime test jobs are executed.
We use the list of runtime tests returned by node2:
"tests.boot.test_edk2.TestEdk2.test_run"
We convert each element of this list to get the path to the test source
file and the name of the test:
"support/testing/tests/boot/test_edk2.py"
TestEdk2
With that, we can grep into the test source file to retrieve the runner
tag placed one line above the test class:
# GitLab-runner: large
class TestEdk2(infra.basetest.BRTest):
Once the runner tag is retrieved, it's used to use the corresponding
runner template to the runtime test job:
tests.boot.test_edk2.TestEdk2.test_run: { extends: [ .runtime_test_base, .runner-large ]}
GitLab runners hosted by the Buildroot project should be able to run any
jobs, so a specific runner tag "buildroot-runner" is used to allow
running a job on such runners. The "buildroot-runner" tag is used in
addition to GitLab ones to run a job on the Buildroot runner or on a
shared GitLab-CI runner.
If a test can't be executed by any shared GitLab-CI runners, we have
to use a runner owned by the Buildroot project. In this case we have
to use a specific template ".runner-buildroot-runner-only". There is no
such runtime test at the moment.
The proposed classification is based on a previous pipeline analysis
[5]:
- Tests lasting more than 3 hours will use 2xlarge runners.
- Tests lasting more than 2 hours will use xlarge runners.
- Tests lasting more than 1 hours will use large runners.
- Tests building a kernel or a toolchain will use medium runners.
- All other tests will use small runners when possible.
CI minute cost estimate:
tests.package.test_clang.TestClangCompilerRT.test_run lasts 4h25 on the
Buildroot runner. If we this duration for 2xlarge runners, the CI
minute consumed would be:
(265 / 60) * 12 * 0.5 = 26,5
With 6 jobs using a 2xlarge runners we used ~160 CI minutes.
tests.package.test_kmscube.TestKmsCube.test_run list 2h04 on the
Buildroot runner. If we this duration for xlarge runners, the CI
minute consumed would be:
(124 / 60) * 6 * 0.5 = 6,2
With 4 jobs using a xlarge runners we used ~37 CI minutes.
tests.package.test_weston.TestWeston.test_run last 1h15 on th
Buildroot runner. If we this duration for large runners, the CI
minute consumed would be:
(75 / 60) * 3 * 0.5 = 1.87
With 28 jobs using a large runners we used ~53 CI minutes.
tests.package.test_gstreamer1.TestGstreamer1.test_run last 46min on the
Buildroot runner. If we this duration for large runners, the CI
minute consumed would be:
(46 / 60) * 2 * 0.5 = 0.76
With 31 jobs using a medium runners we used ~24 CI minutes.
tests.package.test_python.TestPython3Py.test_run last 13min on the
Buildroot runner. If we this duration for large runners, the CI
minute consumed would be:
(13 / 60) * 1 * 0.5 = 0.1
With 691 jobs using a medium runners we used ~69 CI minutes.
In total, one pipeline for the runtime tests cost ~350 CI minutes.
We run such pipeline once a week (on Monday), one for each Buildroot
releases every 3 month, one for each stable and LTS release per month,
and one for each release candidate (3).
Worst case (realse month):
(4 weeks + 1 release + 1 stable + 1 LTS + 3 release candidate) * 350 CI
minutes: 3500 CI minutes / 50000.
So we should be able to run our pipeline without exhausting our CI
minutes credit.
[1] https://docs.gitlab.com/ci/runners/hosted_runners/linux/#machine-types-available-for-linux---x86-64
[2] https://docs.gitlab.com/ci/pipelines/compute_minutes/#cost-factorshttps://docs.gitlab.com/ci/pipelines/compute_minutes/#compute-usage-calculationhttps://docs.gitlab.com/ci/pipelines/compute_minutes/#cost-factors-of-hosted-runners-for-gitlabcom
[3] https://gitlab.com/buildroot.org/gitlab-oss
[4] https://docs.gitlab.com/ci/runners/hosted_runners/#gitlabcom-hosted-runner-workflow
[5] https://gitlab.com/buildroot.org/buildroot/-/pipelines/2416603721
Signed-off-by: Romain Naour <romain.naour@smile.fr>
[Arnout:
- simplify parsing of test_file and test_name;
- match the entire test_name instead of substring;
- assume "small" by default;
- remove the "small" tags;
- use "gitlab-runner" instead of "Gitlab-runner".
]
Signed-off-by: Arnout Vandecappelle <arnout@rnout.be>
For host packages, this commit adds the same `ignore_cves` list as their
target counterpart and make it available from the `show-info` output.
When generating a CycloneDX SBOM with `make show-info-all |
utils/generate-cyclonedx` and running an analysis over it with
`support/script/cve-check`, multiple vulnerabilities
entries would be created with different analysis for packages that have
both a host and target variant that include IGNORE_CVES entries.
This is the case for the grub2 package that include ignored
vulnerabilities that patch both the target and host package but aren't
declared as ignored for the host package. This resulted in
vulnerabilities marked as 'exploitable' for the host variant while it
is patched.
Signed-off-by: Thomas Perale <thomas.perale@mind.be>
Signed-off-by: Thomas Petazzoni <thomas.petazzoni@bootlin.com>
Before this commit, only one entry per vulnerability ID was added to the
output. In CycloneDX, if you need to provide different analyses for
different affected components with the same vulnerability ID, you must
create multiple entries with the same ID.
When running `cve-check` with the `--include-resolved` argument, the
analysis of some vulnerabilities would get overwritten, which led to
undefined analysis results.
This is especially true when running the analysis on multiple components
with the same name but different versions. For instance, if the input
SBOM includes both the `gnupg` and `gnupg2` packages, CVE-2025-68973
could be included. This CVE might be exploitable for the `gnupg` package
but resolved for `gnupg2`. Therefore, a single analysis entry cannot
cover both cases.
This commit fixes the logic for adding vulnerabilities to the output
SBOM. A vulnerability is now added as a new entry if:
1. A vulnerability with the same ID doesn't exist yet.
2. The affect of the new vulnerability is not the same as the one
already present.
For the CVE-2025-68973 example this would result in the following
output:
```json
[
{
"id": "CVE-2025-68973",
"analysis": {
"state": "exploitable"
}
"affects": [
{"ref": "gnupg"}
]
},
{
"id": "CVE-2025-68973",
"analysis": {
"state": "resolved"
}
"affects": [
{"ref": "gnupg2"}
]
}
]
```
45 vulnerabilities were concerned by this bug over the Buildroot tree.
Co-Authored-By: Tim Soubry <tim.soubry@mind.be>
Signed-off-by: Thomas Perale <thomas.perale@mind.be>
Signed-off-by: Thomas Petazzoni <thomas.petazzoni@bootlin.com>
The 'bom-ref' are optional and since we don't reference the
vulnerabilities from anywhere else in the SBOM they are not necessary in
this case.
In the following commit, cve-check will potentially emit multiple
vulnerabilities that have the same id. So using the vulnerability id
as 'bom-ref' won't be correct as the 'bom-ref' needs to be unique
unlike the id property.
Signed-off-by: Thomas Perale <thomas.perale@mind.be>
Signed-off-by: Thomas Petazzoni <thomas.petazzoni@bootlin.com>
Always run this script from the output of 'generate-cyclonedx'. Do not re-run
this script over an already analysed SBOM.
Signed-off-by: Thomas Perale <thomas.perale@mind.be>
Signed-off-by: Thomas Petazzoni <thomas.petazzoni@bootlin.com>
Normalize vulnerability timestamps to RFC 3339 format with explicit UTC
timezone suffix for CycloneDX 1.6 compliance.
This fixes validation errors in sbom-utility and makes the generated
SBOM with vulnerabilities compatible with DependencyTrack VEX parsers.
The NVD JSON data feeds provide timestamps in ISO 8601 format without timezone
information (e.g., "1999-01-01T05:00:00.000"), but CycloneDX 1.6 requires
RFC 3339 format with explicit timezone designation (e.g.,
"1999-01-01T05:00:00.000Z").
Add nvd_datetime_to_rfc3339() helper function to convert timestamps before
serialization.
Validation results:
Before fix:
$ sbom-utility validate -i cve/cve_report_current.json
[INFO] BOM valid against JSON schema: 'false'
[INFO] (234) schema errors detected.
Error example:
{
"type": "format",
"field": "vulnerabilities.0.updated",
"context": "(root).vulnerabilities.0.updated",
"description": "Does not match format 'date-time'",
"value": "2025-04-03T01:03:51.193"
}
After fix:
$ sbom-utility validate -i cve/cve_report_update.json
[INFO] BOM valid against JSON schema: 'true'
Tested-with: sbom-utility v0.18.1
Co-authored-by: Fabien Lehoussel <fabien.lehoussel@smile.fr>
Signed-off-by: Thomas Perale <thomas.perale@mind.be>
Signed-off-by: Thomas Petazzoni <thomas.petazzoni@bootlin.com>
Replace Gentoo patch from 2018 with rebased version of an upstream
commit from 2022 which also fixes build errors introduced by gcc 14.x:
access/rdp.c: In function 'postConnectHandler':
access/rdp.c:238:39: error: assignment to 'pDesktopResize' {aka 'int
(*)(struct rdp_context *)'} from incompatible pointer type 'void
(*)(rdpContext *)' {aka 'void (*)(struct rdp_context *)'}
[-Wincompatible-pointer-types]
238 | p_instance->update->DesktopResize = desktopResizeHandler;
| ^
No autobuilder error was recorded, the build error can be reproduced
with this defconfig:
BR2_x86_64=y
BR2_TOOLCHAIN_EXTERNAL=y
BR2_PACKAGE_VLC=y
BR2_PACKAGE_FREERDP=y
Signed-off-by: Bernd Kuhls <bernd@kuhls.net>
Signed-off-by: Thomas Petazzoni <thomas.petazzoni@bootlin.com>
Commit 324612d68e fixed several compiler warnings,
but actually introduced a new one by increasing the buffer size in confdata.c that gets passed
along to file_write_dep in util.c, because buf2's size wasn't increased along with it.
./util.c: In function ‘file_write_dep’:
./util.c:86:26: warning: ‘%s’ directive writing 10 or more bytes into a region of size between 1 and 4097 [-Wformat-overflow=]
86 | sprintf(buf2, "%s%s", dir, name);
| ^~
./util.c:86:9: note: ‘sprintf’ output 11 or more bytes (assuming 4107) into a destination of size 4097
86 | sprintf(buf2, "%s%s", dir, name);
| ^~~~~~~~~~~~~~~~~~~~~~~~~~~~~~~~
Fix this by increasing the size of buf2 to match the passed buffer size.
Signed-off-by: Devreese Jorik <jorik.devreese@barco.com>
Signed-off-by: Thomas Devoogdt <thomas.devoogdt@barco.com>
Signed-off-by: Peter Korsgaard <peter@korsgaard.com>
The commit [1] introduced fixes for the following CVEs:
- CVE-2017-8372: The mad_layer_III function in layer3.c in Underbit MAD
libmad 0.15.1b, if NDEBUG is omitted, allows remote attackers to cause
a denial of service (assertion failure and application exit) via a
crafted audio file.
- CVE-2017-8373: The mad_layer_III function in layer3.c in Underbit MAD
libmad 0.15.1b allows remote attackers to cause a denial of service
(heap-based buffer overflow and application crash) or possibly have
unspecified other impact via a crafted audio file.
- CVE-2017-8374: The mad_bit_skip function in bit.c in Underbit MAD
libmad 0.15.1b allows remote attackers to cause a denial of service
(heap-based buffer over-read and application crash) via a crafted
audio file.
In commit [2], the patches ended up not being applied anymore because
the APPLY_PATCHES step was called before the patch content exists.
This commit import the fixes in Buildroot.
[1] 858df3643f package/libmad: switch to debian to fix CVEs
[2] b21184a877 package/libmad: update the patches to be applied with fuzz 0
Signed-off-by: Thomas Perale <thomas.perale@mind.be>
Signed-off-by: Thomas Petazzoni <thomas.petazzoni@bootlin.com>
In Buildroot there are multiple way to apply patches on a package [1]
- Adding `.patch` file in the package directory.
- Define `<pkg>_PATCH` variable with the location of the patch tar.gz.
It used to download Debian patches tarball.
- Implement custom patching logic with `PRE`/`POST` patches hooks.
The libmad package is downloading a diff file from the Debian
mirror with the `<pkg>_PATCH` method [2] and then apply that diff to
create a directory containing patches. The patches are then applied in
the `PRE_PATCH_HOOK`.
The Debian patches were integrated in commit [4], in commit [5] the
application of the patches was moved to the PRE_PATCH_HOOK.
The problem is that in the PRE_PATCH step the `_PATCH` downloaded from
Debian don't exist yet and end up not being applied at all.
Since this is not used, remove the Debian patches.
[1] https://buildroot.org/downloads/manual/manual.html#patch-policy
[2] http://snapshot.debian.org/archive/debian/20190310T213528Z/pool/main/libm/libmad/libmad_0.15.1b-10.diff.gz
[3] 1167d0ff3d docs/manual: mention CVE trailer
[4] 858df3643f package/libmad: switch to debian to fix CVEs
[5] b21184a877 package/libmad: update the patches to be applied with fuzz 0
Signed-off-by: Thomas Perale <thomas.perale@mind.be>
Signed-off-by: Thomas Petazzoni <thomas.petazzoni@bootlin.com>
In Buildroot there are multiple way to apply patches on a package [1]
- Adding `.patch` file in the package directory.
- Define `<pkg>_PATCH` variable with the location of the patch tar.gz.
It used to download Debian patches tarball.
- Implement custom patching logic with `PRE`/`POST` patches hooks.
To make the CycloneDX SBOM generation not dependant on downloading the
packages, the two last options have the downside of not appearing on the
generated SBOM.
The heirloom-mailx package is downloading a tarball from the Debian
mirror with the `<pkg>_PATCH` method [2].
To improve the tracking of the patched vulnerabilities for the
heirloom-mailx package this commit import the patches previously
downloaded with the `_PATCH` variable in the Buildroot tree. This allows
to add the `CVE:` trailer [3] on the patches that fix vulnerabilities to
better track which patch is fixing the vulnerability.
[1] https://buildroot.org/downloads/manual/manual.html#patch-policy
[2] http://snapshot.debian.org/archive/debian/20150815T155609Z/pool/main/h/heirloom-mailx/heirloom-mailx_12.5-5.debian.tar.xz
[3] 1167d0ff3d docs/manual: mention CVE trailer
Signed-off-by: Thomas Perale <thomas.perale@mind.be>
Signed-off-by: Thomas Petazzoni <thomas.petazzoni@bootlin.com>
In Buildroot there are multiple way to apply patches on a package [1]
- Adding `.patch` file in the package directory.
- Define `<pkg>_PATCH` variable with the location of the patch tar.gz.
It used to download Debian patches tarball.
- Implement custom patching logic with `PRE`/`POST` patches hooks.
To make the CycloneDX SBOM generation not dependant on downloading the
packages, the two last options have the downside of not appearing on the
generated SBOM.
The unzip package is downloading a tarball from the Debian mirror with
the `<pkg>_PATCH` method [2].
To improve the tracking of the patched vulnerabilities for the unzip
package this commit import the patches previously downloaded with the
`_PATCH` variable in the Buildroot tree.
This allows to add the `CVE:` trailer [3] on the patches that fix
vulnerabilities to better track which patch is fixing the vulnerability.
[1] https://buildroot.org/downloads/manual/manual.html#patch-policy
[2] https://snapshot.debian.org/archive/debian/20250311T215724Z/pool/main/u/unzip/unzip_6.0-29.debian.tar.xz
[3] 1167d0ff3d docs/manual: mention CVE trailer
Signed-off-by: Thomas Perale <thomas.perale@mind.be>
Signed-off-by: Thomas Petazzoni <thomas.petazzoni@bootlin.com>
See here for a changelog:
https://downloads.asterisk.org/pub/telephony/asterisk/ChangeLog-22-current.html
Pjsip was updated to 2.16.
Fixes some security issues in pjsip:
Author: Mike Bradeen Date: 2026-03-23
Address the following pjproject security vulnerabilities
GHSA-j29p-pvh2-pvqp - Buffer overflow in ICE with long username
GHSA-8fj4-fv9f-hjpc - Heap use-after-free in PJSIP presense subscription termination header
GHSA-g88q-c2hm-q7p7 - ICE session use-after-free race conditions
GHSA-x5pq-qrp4-fmrj - Out-of-bounds read in SIP multipart parsing
Signed-off-by: Waldemar Brodkorb <wbx@openadk.org>
Signed-off-by: Peter Korsgaard <peter@korsgaard.com>
https://santuario.apache.org/
"July 2024
As announced early this year, the C++ library has been officially
retired. A fork of this code base has been migrated to the Shibboleth
Project, which has been the sole maintainer for a number of years now.
See the Shibboleth wiki for notable caveats regarding usage of this
code."
https://shibboleth.atlassian.net/wiki/spaces/DEV/pages/3726671873/Santuario
"The C++ xml-security-c library has been retired at Apache and is now
solely maintained by the Shibboleth Project for our use only. Use by
any other project, while permitted freely under the license, is
ill-advised and unsupported by the Shibboleth Project. While we
continue to publish a fork of the code in our repository, and will
accept bug reports and certainly security reports, we do not promise
any responsiveness to third parties, and urge that no other projects
rely on this code. Existing users should seek alternatives or consider
forking the code for their own use."
The package is unmaintained and will cause build errors with the
upcoming bump of OpenSSL to 4.0.0. No other package depends on it so we
can safely remove it from buildroot.
Signed-off-by: Bernd Kuhls <bernd@kuhls.net>
Signed-off-by: Arnout Vandecappelle <arnout@rnout.be>
This is the file the original commit d889838098 ("package/pkg-generic.mk:
Remove Info documents dir entry") wanted to delete.
However, it only works for host packages. Target packages are (usually)
installed with prefix /usr, so the info dir is /usr/share/info. Simply
remove both of them, even if one of them only exists for host packages
and the other only for target packages.
Signed-off-by: John Ernberg <j@j-ernberg.se>
Signed-off-by: Arnout Vandecappelle <arnout@rnout.be>
Buildroot commit d4b8a42fb2 bumped the
package from 1.0.16 to 1.0.18.
Upstream added optional neon support in version 1.0.17:
f22cf00a86
The configure check detects neon support:
-- Performing Test HAVE_NEON
-- Performing Test HAVE_NEON - Success
but causes a build error at linking stage:
[100%] Linking CXX executable dec265
/builds/bkuhls/buildroot/br-test-pkg/bootlin-armv7m-uclibc/host/opt/ext-toolchain/arm-buildroot-uclinux-uclibcgnueabi/bin/ld.real:
error: ../libde265/libde265.a(hevcdsp_qpel_neon.S.o):
conflicting architecture profiles A/M
so we add a configure option to disable neon support.
The build error was not yet detected by the autobuilders but can be
reproduced using this defconfig:
BR2_arm=y
BR2_cortex_m4=y
BR2_TOOLCHAIN_EXTERNAL=y
BR2_TOOLCHAIN_EXTERNAL_BOOTLIN_ARMV7M_UCLIBC_STABLE=y
BR2_PACKAGE_LIBDE265=y
Signed-off-by: Bernd Kuhls <bernd@kuhls.net>
Signed-off-by: Peter Korsgaard <peter@korsgaard.com>
Buildroot commit d4b8a42fb2 bumped the
package to version 1.0.18 which introduced build errors on sparc:
/home/autobuild/autobuild/instance-21/output-1/host/lib/gcc/sparc-buildroot-linux-uclibc/15.2.0/../../../../sparc-buildroot-linux-uclibc/bin/ld:
../libde265/libde265.so.0.1.12: undefined reference to
`__atomic_fetch_add_4'
Fixes:
https://autobuild.buildroot.net/results/605/605dc19e86f113662cc35fe055c64c52698d70b4/
Signed-off-by: Bernd Kuhls <bernd@kuhls.net>
Signed-off-by: Peter Korsgaard <peter@korsgaard.com>
- Update email address to v@baodeep.com.
- Take over maintainership of package/amlogic-boot-fip.
Signed-off-by: Viacheslav Bocharov <v@baodeep.com>
Signed-off-by: Julien Olivain <ju.o@free.fr>
Bug fix of bug fix. Changes from version 0.24.10 -> 0.24.12:
* protocol
- fix path traversal bug
- allow empty URI in "lsinfo", "add" etc. (0.24.11 regression)
* playlist: do not allow newlines in song URIs
* input
- curl: require version 7.85.0
* decoder
- pcm: fix stack buffer overflow
- sidplay: fall back to SIDLiteBuilder if ReSIDfpBuilder is unavailable
Signed-off-by: Andreas Ziegler <br025@umbiko.net>
Signed-off-by: Julien Olivain <ju.o@free.fr>
wpewebkit depends directly on OpenGL ES and EGL support, but those
dependencies are not imposed by libepoxy itself. Update the inline
comments so they describe the actual dependency source before relaxing
libepoxy's package-level EGL/GL dependency.
Signed-off-by: Joseph Kogut <joseph.kogut@gmail.com>
Signed-off-by: Arnout Vandecappelle <arnout@rnout.be>
BR2_PACKAGE_WESTON_XWAYLAND currently depends on BR2_PACKAGE_LIBEPOXY,
which implicitly requires either libGL or libEGL. However, the XWayland
glamor support uses libepoxy with EGL, so express that dependency
directly. With only libGL and no libEGL, it fails to build. E.g.,
BR2_aarch64=y
BR2_TOOLCHAIN_EXTERNAL=y
BR2_TOOLCHAIN_EXTERNAL_BOOTLIN=y
BR2_TOOLCHAIN_EXTERNAL_BOOTLIN_AARCH64_GLIBC_STABLE=y
BR2_PACKAGE_MESA3D=y
BR2_PACKAGE_MESA3D_GALLIUM_DRIVER_ETNAVIV=y
BR2_PACKAGE_MESA3D_OPENGL_GLX=y
BR2_PACKAGE_XORG7=y
BR2_PACKAGE_XWAYLAND=y
BR2_PACKAGE_LIBEPOXY=y
fails with:
In file included from ../glamor/glamor_priv.h:73,
from ../glamor/glamor_composite_glyphs.c:25:
../glamor/glamor_context.h:27:10: fatal error: epoxy/egl.h: No such file or directory
27 | #include <epoxy/egl.h>
| ^~~~~~~~~~~~~
Signed-off-by: Joseph Kogut <joseph.kogut@gmail.com>
Signed-off-by: Arnout Vandecappelle <arnout@rnout.be>
The current cog release only supports weston protocols up to weston 14
When weston was bumped to version 15 in
2e6b2b82d5 it broke building cog.
Backport a patch adding weston 15 support to cog.
Fixes: No usable weston-protocols dependency found
Signed-off-by: James Hilliard <james.hilliard1@gmail.com>
Signed-off-by: Arnout Vandecappelle <arnout@rnout.be>
Current build generated pkgconfig/libargon2.pc has wrong version string.
Version: ZERO
Signed-off-by: Andreas Mohr <and@gmx.li>
Signed-off-by: Arnout Vandecappelle <arnout@rnout.be>
Fixes:
"missing #include <memory>" when building with GCC > 11.
Signed-off-by: Michael Nosthoff <buildroot@heine.tech>
Signed-off-by: Romain Naour <romain.naour@smile.fr>
The commit adds an upstream patch to fix the following build failure:
jl2005c/jl2005bcd_decompress.c: In function 'jl2005bcd_decompress':
jl2005c/jl2005bcd_decompress.c:161:46: error: passing argument 3 of 'jpeg_mem_dest' from incompatible pointer type [-Wincompatible-pointer-types]
161 | jpeg_mem_dest (&cinfo, &jpeg_header, &jpeg_header_size);
| ^~~~~~~~~~~~~~~~~
| |
| long unsigned int *
Fixes:
- https://autobuild.buildroot.org/results/cb983d9ad90170aa8d7f2b9a5dfc30055d83b5de
Signed-off-by: Dario Binacchi <dario.binacchi@amarulasolutions.com>
Tested-by: Edgar Bonet <bonet@grenoble.cnrs.fr>
Signed-off-by: Romain Naour <romain.naour@smile.fr>
NSS Makefile build system is pretty weak if used with parallel build. In
this case what happens is that 'ifndef FREEBL_NO_DEPEND' appears in
lib/freebl/manifest.mn and coreconf/Linux.mk. When parallel building
variable FREEBL_NO_DEPEND gets defined if not defined to 1, but in the
2 occurences we end up having on variable set to 1 and 1 still not
defined. This results in:
`
/home/giuliobenetti/br-reproduce/3e046c996825447f48377f7c4361b5db26b84f95/output/host/lib/gcc/arm-buildroot-linux-musleabi/14.3.0/../../../../arm-buildroot-linux-musleabi/bin/ld: Linux2.6_arm_arm-buildroot-linux-musleabi-gcc.br_real_glibc_PTH_DBG.OBJ/Linux_SINGLE_SHLIB/lowhash_vector.o: in function `loader_GetOriginalPathname':
lowhash_vector.c:(.text.loader_GetOriginalPathname+0x68): undefined reference to `PR_SetError'
collect2: error: ld returned 1 exit status
`
So let's pass FREEBL_NO_DEPEND=1 when building to define that variable
instead to let NSS Makefile to calculate it.
Fixes:
https://autobuild.buildroot.net/results/ad4/ad40536728303c56d1d0968e38ac36da12cca416//
Signed-off-by: Giulio Benetti <giulio.benetti@benettiengineering.com>
Signed-off-by: Romain Naour <romain.naour@smile.fr>
Version 0.24.10 change log:
* input
- cache: fix deadlock bug
* decoder
- sidplay: support millisecond-precision time stamps
- sidplay: support libsidplayfp version 3
* database
- upnp: allow building with libupnp 1.14.30 which has fixed the API breakage
* Windows
- work around build failure due to zlib bug
Signed-off-by: Andreas Ziegler <br025@umbiko.net>
Signed-off-by: Julien Olivain <ju.o@free.fr>
There is no CVE assigned with the vendor name "cesenta".
The CPE ID introduced in [1], correctly reference "cesanta" as a CPE
vendor but introduced a typo while writing the vendor metadata in
`mongoose.mk`.
[1] 3d632c941f package/mongoose: add MONGOOSE_CPE_ID_VENDOR
Signed-off-by: Thomas Perale <thomas.perale@mind.be>
Signed-off-by: Julien Olivain <ju.o@free.fr>
Since the last version bump in commit [1] python-sdbus-modemmanager
install step miss-behave following the switch to poetry (as reported
by [2]).
The sdbus-modemmanager python module is intalled in a second
"modemmanager" subdirectory:
$(TARGET_DIR)/lib/python3.14/site-packages/sdbus_block/modemmanager/modemmanager/
This break existing python script using:
from sdbus_block.modemmanager import MMBearer
Fix tool.poetry install step by removing one "modemmanager".
[1] 7c30b1e522
[2] https://github.com/zhanglongqi/python-sdbus-modemmanager/issues/24
Fixes:
https://gitlab.com/buildroot.org/buildroot/-/jobs/13904075359
Signed-off-by: Romain Naour <romain.naour@smile.fr>
Signed-off-by: Julien Olivain <ju.o@free.fr>
- CVE-2026-32853:
LibVNCServer versions 0.9.15 and prior (fixed in commit 009008e)
contain a heap out-of-bounds read vulnerability in the UltraZip
encoding handler that allows a malicious VNC server to cause
information disclosure or application crash. Attackers can exploit
improper bounds checking in the HandleUltraZipBPP() function by
manipulating subrectangle header counts to read beyond the allocated
heap buffer.
For more information, see:
- https://www.cve.org/CVERecord?id=CVE-2026-32853
- https://github.com/LibVNC/libvncserver/security/advisories/GHSA-87q7-v983-qwcj
- 009008e2f4
- CVE-2026-32854:
LibVNCServer versions 0.9.15 and prior (fixed in commit dc78dee)
contain null pointer dereference vulnerabilities in the HTTP proxy
handlers within httpProcessInput() in httpd.c that allow remote
attackers to cause a denial of service by sending specially crafted
HTTP requests. Attackers can exploit missing validation of strchr()
return values in the CONNECT and GET proxy handling paths to trigger
null pointer dereferences and crash the server when httpd and proxy
features are enabled.
For more information, see:
- https://www.cve.org/CVERecord?id=CVE-2026-32854
- https://github.com/LibVNC/libvncserver/security/advisories/GHSA-xjp8-4qqv-5x4x
- dc78dee51a
Signed-off-by: Thomas Perale <thomas.perale@mind.be>
Signed-off-by: Julien Olivain <ju.o@free.fr>
Buildroot commit [1] updated the Kernel for this test, but forgot to
add the "arm/" prefix for the dtb path. Since Linux 6.5, .dts files
have been moved to "arch/arm/boot/dts/" and the test was not able to
find the file anymore, which caused the build to fail.
Fixes:
https://gitlab.com/buildroot.org/buildroot/-/jobs/14297955524
[1] 74e7e07f83
Signed-off-by: Dowan Gullient <dowan.gullient@smile.fr>
[Julien: reword commit log]
Signed-off-by: Julien Olivain <ju.o@free.fr>
Some files were not shown because too many files have changed in this diff
Show More
Reference in New Issue
Block a user
Blocking a user prevents them from interacting with repositories, such as opening or commenting on pull requests or issues. Learn more about blocking a user.